{"text_format":"1","workbook":"xlsx","n_sheets":8,"sheets":["Leader Board","Round 1","Round 2","Round 3","Round 4","Round 5","Round 6","SumSheet"],"not_rendered":{"charts":0,"images":0,"macros":1,"external_links":0,"defined_names":24,"comments":0,"pivot_tables":0},"unopened":[],"bounds":{"document_bytes":16777216,"sheet_cells":100000,"rows_first":2000,"rows_last":500,"rows_between":2000,"halvings":0,"cell_chars":16384,"cell_head_chars":4096},"cells_cut":0,"cells_raw":0,"read":"whole","date_system":"1904"}

{"sheet":"Leader Board","index":0,"n_rows":17,"n_cols":13,"rows_kept":17,"cut":false,"hidden":false,"merged":[[1,1,1,8],[1,12,1,19]]}
[null,null,null,null,null,null,null,null,null,null,null,null,"Used to reformat the leader board after resorting the results. DO NOT MODIFY"]
[null,{"$f":" SeriesName & \" - Round \" & RoundsRun & \" of 6  (Overall)\"","v":"2013 Touring Car Series - Round 4 of 6  (Overall)"}]
[null,"Position","+/-","Driver","Points","Behind","Starts","Laps","Fastest Laps"]
[null,{"$f":"IF(ISNA(VLOOKUP($D4,SeriesSummary,59,FALSE)),\"\",VLOOKUP($D4,SeriesSummary,59,FALSE))","v":1},{"$f":"IF(ISNA(VLOOKUP($D4,SeriesSummary,60,FALSE)),\"\",VLOOKUP($D4,SeriesSummary,60,FALSE))","v":"-"},{"$f":"IF(SumSheet!AV14>0,SumSheet!B14,\"\")","v":"Russell M."},{"$f":"IF(D4<>\"\",IF(ISNA(VLOOKUP($D4,SeriesSummary,57,FALSE)),\"-\",VLOOKUP($D4,SeriesSummary,57,FALSE)),\"\")","v":41},"Leader",{"$f":"IF(ISNA(VLOOKUP($D4,SeriesSummary,47,FALSE)),\"\",VLOOKUP($D4,SeriesSummary,47,FALSE))","v":4},{"$f":"IF(ISNA(VLOOKUP($D4,SeriesSummary,58,FALSE)),\"\",VLOOKUP($D4,SeriesSummary,58,FALSE))","v":864.93},{"$f":"IF(ISNA(VLOOKUP($D4,SeriesSummary,56,FALSE)),\"\",VLOOKUP($D4,SeriesSummary,56,FALSE))","v":2}]
[null,{"$f":"IF(ISNA(VLOOKUP($D5,SeriesSummary,59,FALSE)),\"\",VLOOKUP($D5,SeriesSummary,59,FALSE))","v":2},{"$f":"IF(ISNA(VLOOKUP($D5,SeriesSummary,60,FALSE)),\"\",VLOOKUP($D5,SeriesSummary,60,FALSE))","v":"+1"},{"$f":"IF(SumSheet!AV15>0,SumSheet!B15,\"\")","v":"Shawn G."},28,{"$f":"IF(ISERROR(E5-$E$4),\"\",E5-$E$4)","v":-13},3,647.34,1]
[null,{"$f":"IF(ISNA(VLOOKUP($D6,SeriesSummary,59,FALSE)),\"\",VLOOKUP($D6,SeriesSummary,59,FALSE))","v":3},{"$f":"IF(ISNA(VLOOKUP($D6,SeriesSummary,60,FALSE)),\"\",VLOOKUP($D6,SeriesSummary,60,FALSE))","v":-1},{"$f":"IF(SumSheet!AV13>0,SumSheet!B13,\"\")","v":"Roy M."},27,{"$f":"IF(ISERROR(E6-$E$4),\"\",E6-$E$4)","v":-14},4,803.56000000000006,0]
[null,{"$f":"IF(ISNA(VLOOKUP($D7,SeriesSummary,59,FALSE)),\"\",VLOOKUP($D7,SeriesSummary,59,FALSE))","v":4},{"$f":"IF(ISNA(VLOOKUP($D7,SeriesSummary,60,FALSE)),\"\",VLOOKUP($D7,SeriesSummary,60,FALSE))","v":"+2"},{"$f":"IF(SumSheet!AV12>0,SumSheet!B12,\"\")","v":"Marty M."},25,-16,3,638.62,1]
[null,{"$f":"IF(ISNA(VLOOKUP($D8,SeriesSummary,59,FALSE)),\"\",VLOOKUP($D8,SeriesSummary,59,FALSE))","v":5},{"$f":"IF(ISNA(VLOOKUP($D8,SeriesSummary,60,FALSE)),\"\",VLOOKUP($D8,SeriesSummary,60,FALSE))","v":-1},{"$f":"IF(SumSheet!AV4>0,SumSheet!B4,\"\")","v":"Ary B."},23,-18,3,643.21,0]
[null,{"$f":"IF(ISNA(VLOOKUP($D9,SeriesSummary,59,FALSE)),\"\",VLOOKUP($D9,SeriesSummary,59,FALSE))","v":6},{"$f":"IF(ISNA(VLOOKUP($D9,SeriesSummary,60,FALSE)),\"\",VLOOKUP($D9,SeriesSummary,60,FALSE))","v":"+1"},{"$f":"IF(SumSheet!AV9>0,SumSheet!B9,\"\")","v":"Brian H."},17,-24,3,569.04,0]
[null,{"$f":"IF(ISNA(VLOOKUP($D10,SeriesSummary,59,FALSE)),\"\",VLOOKUP($D10,SeriesSummary,59,FALSE))","v":7},{"$f":"IF(ISNA(VLOOKUP($D10,SeriesSummary,60,FALSE)),\"\",VLOOKUP($D10,SeriesSummary,60,FALSE))","v":-3},{"$f":"IF(SumSheet!AV10>0,SumSheet!B10,\"\")","v":"Jim J."},16,-25,3,400.93,0]
[null,{"$f":"IF(ISNA(VLOOKUP($D11,SeriesSummary,59,FALSE)),\"\",VLOOKUP($D11,SeriesSummary,59,FALSE))","v":8},{"$f":"IF(ISNA(VLOOKUP($D11,SeriesSummary,60,FALSE)),\"\",VLOOKUP($D11,SeriesSummary,60,FALSE))","v":"-"},{"$f":"IF(SumSheet!AV5>0,SumSheet!B5,\"\")","v":"Austin C."},14,-27,3,522.61,0]
[null,{"$f":"IF(ISNA(VLOOKUP($D12,SeriesSummary,59,FALSE)),\"\",VLOOKUP($D12,SeriesSummary,59,FALSE))","v":9},{"$f":"IF(ISNA(VLOOKUP($D12,SeriesSummary,60,FALSE)),\"\",VLOOKUP($D12,SeriesSummary,60,FALSE))","v":"-"},{"$f":"IF(SumSheet!AV8>0,SumSheet!B8,\"\")","v":"Brett L."},8,-33,3,444.85,0]
[null,{"$f":"IF(ISNA(VLOOKUP($D13,SeriesSummary,59,FALSE)),\"\",VLOOKUP($D13,SeriesSummary,59,FALSE))","v":10},{"$f":"IF(ISNA(VLOOKUP($D13,SeriesSummary,60,FALSE)),\"\",VLOOKUP($D13,SeriesSummary,60,FALSE))","v":-1},{"$f":"IF(SumSheet!AV16>0,SumSheet!B16,\"\")","v":"Stephen B."},5,-36,1,192.35,0]
[null,{"$f":"IF(ISNA(VLOOKUP($D14,SeriesSummary,59,FALSE)),\"\",VLOOKUP($D14,SeriesSummary,59,FALSE))","v":11},{"$f":"IF(ISNA(VLOOKUP($D14,SeriesSummary,60,FALSE)),\"\",VLOOKUP($D14,SeriesSummary,60,FALSE))","v":"-"},{"$f":"IF(SumSheet!AV7>0,SumSheet!B7,\"\")","v":"Brandon M."},3,-38,1,183.75,0]
[null,{"$f":"IF(ISNA(VLOOKUP($D15,SeriesSummary,59,FALSE)),\"\",VLOOKUP($D15,SeriesSummary,59,FALSE))","v":""},{"$f":"IF(ISNA(VLOOKUP($D15,SeriesSummary,60,FALSE)),\"\",VLOOKUP($D15,SeriesSummary,60,FALSE))","v":""},{"$f":"IF(SumSheet!AV6>0,SumSheet!B6,\"\")","v":""},"","","","",""]
[null,{"$f":"IF(ISNA(VLOOKUP($D16,SeriesSummary,59,FALSE)),\"\",VLOOKUP($D16,SeriesSummary,59,FALSE))","v":""},{"$f":"IF(ISNA(VLOOKUP($D16,SeriesSummary,60,FALSE)),\"\",VLOOKUP($D16,SeriesSummary,60,FALSE))","v":""},{"$f":"IF(SumSheet!AV11>0,SumSheet!B11,\"\")","v":""},"","","","",""]
[null,{"$f":"IF(ISNA(VLOOKUP($D17,SeriesSummary,59,FALSE)),\"\",VLOOKUP($D17,SeriesSummary,59,FALSE))","v":""},{"$f":"IF(ISNA(VLOOKUP($D17,SeriesSummary,60,FALSE)),\"\",VLOOKUP($D17,SeriesSummary,60,FALSE))","v":""},{"$f":"IF(SumSheet!AV17>0,SumSheet!B17,\"\")","v":""},"","","","",""]

{"sheet":"Round 1","index":1,"n_rows":41,"n_cols":7,"rows_kept":41,"cut":false,"hidden":false,"merged":[[1,1,1,6]]}
[]
[null,{"$f":"SeriesName & \" - Round 1\"","v":"2013 Touring Car Series - Round 1"}]
[null,"Position","Driver","Laps","Fastest Lap","Fastest Lap Bonus","Points"]
[null,1,"Russell M.",216.82,3.992,{"$f":"IF(C4<>\"\",IF(AND(E4=MIN($E$4:$E$15),E4>0),1,0),\"\")","v":1},{"$f":"IF(ISNA(VLOOKUP(B4,Points,2,FALSE)),\"\",VLOOKUP(B4,Points,2,FALSE)+F4)","v":11}]
[null,2,"Shawn G.",212.28,4.0940000000000003,{"$f":"IF(C5<>\"\",IF(AND(E5=MIN($E$4:$E$15),E5>0),1,0),\"\")","v":0},9]
[null,3,"Marty M.",209.87,4.1539999999999999,0,8]
[null,4,"Jim J.",187.52,4.4470000000000001,0,7]
[null,5,"Brian H.",175.95,4.6180000000000003,0,6]
[null,6,"Roy M.",167.8,4.681,0,5]
[null,7,"Austin C.",166.55,4.484,0,4]
[null,8,"Brett L.",137.80000000000001,4.6390000000000002,0,3]
[null,null,null,null,null,"",""]
[null,null,null,null,null,"",""]
[null,null,null,null,null,"",""]
[null,null,null,null,null,"",""]
[]
[null,"Driver","Lane","Slowest Lap Time","Fastest Lap Time","Average Lap Time","Total Laps"]
[null,"Russell M.",1,5.9089999999999998,4.093,4.2190000000000003,71]
[null,"Russell M.",2,4.2450000000000001,3.992,4.09,73.819999999999993]
[null,"Russell M.",3,5.0339999999999998,4,4.149,72]
[null,"Shawn G.",1,6.3689999999999998,4.1130000000000004,4.2930000000000001,71]
[null,"Shawn G.",2,6.7809999999999997,4.0990000000000002,4.2480000000000002,71.28]
[null,"Shawn G.",3,6.2069999999999999,4.0940000000000003,4.3140000000000001,70]
[null,"Marty M.",1,5.2990000000000004,4.1539999999999999,4.3209999999999997,69]
[null,"Marty M.",2,6.194,4.1689999999999996,4.2850000000000001,70.87]
[null,"Marty M.",3,4.9050000000000002,4.1769999999999996,4.266,70]
[null,"Jim J.",1,9.27,4.4470000000000001,4.9370000000000003,60]
[null,"Jim J.",2,6.5140000000000002,4.5780000000000003,4.7610000000000001,63.52]
[null,"Jim J.",3,5.9180000000000001,4.5380000000000003,4.7149999999999999,64]
[null,"Brian H.",1,9.391,4.8639999999999999,5.415,55]
[null,"Brian H.",2,6.1630000000000003,4.6180000000000003,4.8520000000000003,61.95]
[null,"Brian H.",3,8.0399999999999991,4.7229999999999999,5.0519999999999996,59]
[null,"Roy M.",1,15.247,4.681,5.5510000000000002,54]
[null,"Roy M.",2,7.7469999999999999,4.76,5.1980000000000004,57.8]
[null,"Roy M.",3,14.15,4.8970000000000002,5.3680000000000003,56]
[null,"Austin C.",1,7.359,4.524,5.09,59]
[null,"Austin C.",2,8.8870000000000005,4.6230000000000002,6.492,46.55]
[null,"Austin C.",3,8.5790000000000006,4.484,4.9119999999999999,61]
[null,"Brett L.",1,166.297,4.6390000000000002,10.991,27]
[null,"Brett L.",2,7.1150000000000002,4.7080000000000002,5.1719999999999997,58.8]
[null,"Brett L.",3,9.0670000000000002,4.9509999999999996,5.7709999999999999,52]

{"sheet":"Round 2","index":2,"n_rows":44,"n_cols":7,"rows_kept":44,"cut":false,"hidden":false,"merged":[[1,1,1,6]]}
[]
[null,{"$f":"SeriesName & \" - Round 2\"","v":"2013 Touring Car Series - Round 2"}]
[null,"Position","Driver","Laps","Fastest Lap","Fastest Lap Bonus","Points"]
[null,1,"Shawn G.",218.46,3.9849999999999999,{"$f":"IF(C4<>\"\",IF(AND(E4=MIN($E$4:$E$15),E4>0),1,0),\"\")","v":1},{"$f":"IF(ISNA(VLOOKUP(B4,Points,2,FALSE)),\"\",VLOOKUP(B4,Points,2,FALSE)+F4)","v":11}]
[null,2,"Russell M.",212.47,4.0350000000000001,{"$f":"IF(C5<>\"\",IF(AND(E5=MIN($E$4:$E$15),E5>0),1,0),\"\")","v":0},9]
[null,3,"Roy M.",211.4,4.0940000000000003,0,8]
[null,4,"Ary B.",210.8,4.1310000000000002,0,7]
[null,5,"Brian H.",195.86,4.133,0,6]
[null,6,"Stephen B.",192.35,4.1779999999999999,0,5]
[null,7,"Jim J.",188.41,4.3780000000000001,0,4]
[null,8,"Brandon M.",183.75,4.37,0,3]
[null,9,"Brett L.",145.19999999999999,4.6070000000000002,0,2]
[null,null,null,null,null,"",""]
[null,null,null,null,null,"",""]
[null,null,null,null,null,"",""]
[]
[null,"Driver","Lane","Slowest Lap Time","Fastest Lap Time","Average Lap Time","Total Laps"]
[null,"Shawn G.",1,4.6459999999999999,4.0519999999999996,4.1420000000000003,72.459999999999994]
[null,"Shawn G.",2,4.3849999999999998,3.9980000000000002,4.133,73]
[null,"Shawn G.",3,4.6310000000000002,3.9849999999999999,4.0880000000000001,73]
[null,"Russell M.",1,6.0179999999999998,4.093,4.2590000000000003,70.47]
[null,"Russell M.",2,5.4509999999999996,4.0350000000000001,4.1859999999999999,72]
[null,"Russell M.",3,7.6710000000000003,4.0780000000000003,4.2629999999999999,70]
[null,"Roy M.",1,7.016,4.1100000000000003,4.3109999999999999,70.400000000000006]
[null,"Roy M.",2,5.9640000000000004,4.0940000000000003,4.2220000000000004,71]
[null,"Roy M.",3,5.19,4.1239999999999997,4.2480000000000002,70]
[null,"Ary B.",1,5.5540000000000003,4.1619999999999999,4.2610000000000001,70.8]
[null,"Ary B.",2,8.1679999999999993,4.1310000000000002,4.3209999999999997,69]
[null,"Ary B.",3,4.6040000000000001,4.1639999999999997,4.2350000000000003,71]
[null,"Brian H.",1,7.1319999999999997,4.133,4.72,63.86]
[null,"Brian H.",2,6.92,4.1680000000000001,4.5309999999999997,66]
[null,"Brian H.",3,7.0270000000000001,4.1340000000000003,4.5549999999999997,66]
[null,"Stephen B.",1,8.1289999999999996,4.1779999999999999,4.6740000000000004,64.349999999999994]
[null,"Stephen B.",2,6.39,4.2149999999999999,4.5679999999999996,65]
[null,"Stephen B.",3,5.69,4.3650000000000002,4.6859999999999999,63]
[null,"Jim J.",1,6.8520000000000003,4.3780000000000001,4.7880000000000003,62.41]
[null,"Jim J.",2,8.1319999999999997,4.444,4.7080000000000002,64]
[null,"Jim J.",3,11.015000000000001,4.4640000000000004,4.8460000000000001,62]
[null,"Brandon M.",1,6.8739999999999997,4.4329999999999998,5.0110000000000001,60.75]
[null,"Brandon M.",2,8.4339999999999993,4.37,4.8819999999999997,61]
[null,"Brandon M.",3,7.2530000000000001,4.4809999999999999,4.8259999999999996,62]
[null,"Brett L.",1,9.4719999999999995,4.6070000000000002,5.2359999999999998,57.2]
[null,"Brett L.",2,21.675999999999998,4.6950000000000003,8.67,35]
[null,"Brett L.",3,10.314,4.8140000000000001,5.6180000000000003,53]

{"sheet":"Round 3","index":3,"n_rows":35,"n_cols":7,"rows_kept":35,"cut":false,"hidden":false,"merged":[[1,1,1,6]]}
[]
[null,{"$f":"SeriesName & \" - Round 3\"","v":"2013 Touring Car Series - Round 3"}]
[null,"Position","Driver","Laps","Fastest Lap","Fastest Lap Bonus","Points"]
[null,1,"Russell M.",218.27,3.9670000000000001,{"$f":"IF(C4<>\"\",IF(AND(E4=MIN($E$4:$E$15),E4>0),1,0),\"\")","v":1},{"$f":"IF(ISNA(VLOOKUP(B4,Points,2,FALSE)),\"\",VLOOKUP(B4,Points,2,FALSE)+F4)","v":11}]
[null,2,"Ary B.",216.91,4.0289999999999999,{"$f":"IF(C5<>\"\",IF(AND(E5=MIN($E$4:$E$15),E5>0),1,0),\"\")","v":0},9]
[null,3,"Roy M.",212.24,4.0830000000000002,0,8]
[null,4,"Marty M.",211.45,4.0709999999999997,0,7]
[null,5,"Austin C.",182.24,4.3559999999999999,0,6]
[null,6,"Jim J.",25,4.42,0,5]
[null,null,null,null,null,"",""]
[null,null,null,null,null,"",""]
[null,null,null,null,null,"",""]
[null,null,null,null,null,"",""]
[null,null,null,null,null,"",""]
[null,null,null,null,null,"",""]
[]
[null,"Driver","Lane","Slowest Lap Time","Fastest Lap Time","Average Lap Time","Total Laps"]
[null,"Russell Mill",1,6.0750000000000002,3.9670000000000001,4.1390000000000002,72.27]
[null,"Russell Mill",2,5.3369999999999997,3.9750000000000001,4.1130000000000004,73]
[null,"Russell Mill",3,4.33,4.0129999999999999,4.1449999999999996,73]
[null,"Ary Barbosa",1,4.851,4.0590000000000002,4.1529999999999996,72.91]
[null,"Ary Barbosa",2,6.0039999999999996,4.0289999999999999,4.1260000000000003,72]
[null,"Ary Barbosa",3,5.1779999999999999,4.0519999999999996,4.1769999999999996,72]
[null,"Roy Martz",1,4.6740000000000004,4.0830000000000002,4.2050000000000001,72.239999999999995]
[null,"Roy Martz",2,6.032,4.1079999999999997,4.2409999999999997,70]
[null,"Roy Martz",3,4.6689999999999996,4.2119999999999997,4.2939999999999996,70]
[null,"Marty Muehlegger",1,4.7240000000000002,4.0709999999999997,4.1959999999999997,71.45]
[null,"Marty Muehlegger",2,5.6059999999999999,4.0890000000000004,4.3170000000000002,70]
[null,"Marty Muehlegger",3,5.3659999999999997,4.1390000000000002,4.2640000000000002,70]
[null,"Austin Cowling",1,8.3130000000000006,4.3559999999999999,4.7640000000000002,63.24]
[null,"Austin Cowling",2,6.6349999999999998,4.3879999999999999,4.8600000000000003,62]
[null,"Austin Cowling",3,7.1859999999999999,4.4480000000000004,5.2480000000000002,57]
[null,"Jim Johnson",1,6.891,4.5609999999999999,5.4390000000000001,7]
[null,"Jim Johnson",2,"--","--","--",0]
[null,"Jim Johnson",3,6.58,4.42,19.402000000000001,18]

{"sheet":"Round 4","index":4,"n_rows":41,"n_cols":7,"rows_kept":41,"cut":false,"hidden":false,"merged":[[1,1,1,6]]}
[]
[null,{"$f":"SeriesName & \" - Round 4\"","v":"2013 Touring Car Series - Round 4"}]
[null,"Position","Driver","Laps","Fastest Lap","Fastest Lap Bonus","Points"]
[null,1,"Russell M.",217.37,3.9510000000000001,{"$f":"IF(C4<>\"\",IF(AND(E4=MIN($E$4:$E$15),E4>0),1,0),\"\")","v":0},{"$f":"IF(ISNA(VLOOKUP(B4,Points,2,FALSE)),\"\",VLOOKUP(B4,Points,2,FALSE)+F4)","v":10}]
[null,2,"Marty M.",217.3,3.9470000000000001,{"$f":"IF(C5<>\"\",IF(AND(E5=MIN($E$4:$E$15),E5>0),1,0),\"\")","v":1},10]
[null,3,"Shawn G.",216.6,3.99,0,8]
[null,4,"Ary B.",215.5,4.0620000000000003,0,7]
[null,5,"Roy M.",212.12,4.0369999999999999,0,6]
[null,6,"Brian H.",197.23,4.133,0,5]
[null,7,"Austin C.",173.82,4.5049999999999999,0,4]
[null,8,"Brett L.",161.85,4.7,0,3]
[null,null,null,null,null,"",""]
[null,null,null,null,null,"",""]
[null,null,null,null,null,"",""]
[null,null,null,null,null,"",""]
[]
[null,"Driver","Lane","Slowest Lap Time","Fastest Lap Time","Average Lap Time","Total Laps"]
[null,"Russell M.",1,5.93,4.0170000000000003,4.194,71]
[null,"Russell M.",2,5.7050000000000001,3.9510000000000001,4.1040000000000001,73.37]
[null,"Russell M.",3,4.274,3.99,4.1340000000000003,73]
[null,"Marty M.",1,5.673,4.0330000000000004,4.2169999999999996,71]
[null,"Marty M.",2,5.9119999999999999,3.9470000000000001,4.1310000000000002,73.3]
[null,"Marty M.",3,7.2329999999999997,3.96,4.1020000000000003,73]
[null,"Shawn G.",1,6.1719999999999997,4.008,4.2140000000000004,71]
[null,"Shawn G.",2,6.5270000000000001,3.99,4.1399999999999997,72.599999999999994]
[null,"Shawn G.",3,5.68,4.0069999999999997,4.1369999999999996,73]
[null,"Ary B.",1,5.0709999999999997,4.0620000000000003,4.1420000000000003,72]
[null,"Ary B.",2,5.5460000000000003,4.0759999999999996,4.2210000000000001,71.5]
[null,"Ary B.",3,4.9160000000000004,4.0730000000000004,4.1710000000000003,72]
[null,"Roy M.",1,7.0579999999999998,4.0369999999999999,4.2859999999999996,70]
[null,"Roy M.",2,4.7320000000000002,4.1079999999999997,4.2549999999999999,71.12]
[null,"Roy M.",3,5.4260000000000002,4.0869999999999997,4.2069999999999999,71]
[null,"Brian H.",1,7.1070000000000002,4.149,4.63,64]
[null,"Brian H.",2,6.4269999999999996,4.133,4.444,68.23]
[null,"Brian H.",3,7.891,4.1589999999999998,4.6349999999999998,65]
[null,"Austin C.",1,8.8979999999999997,4.609,5.4950000000000001,54]
[null,"Austin C.",2,7.5650000000000004,4.5049999999999999,4.9560000000000004,61.82]
[null,"Austin C.",3,9.6150000000000002,4.6360000000000001,5.1280000000000001,58]
[null,"Brett L.",1,14.532999999999999,4.7,5.681,53]
[null,"Brett L.",2,7.3970000000000002,4.7439999999999998,5.2249999999999996,57.85]
[null,"Brett L.",3,9.032,5.0810000000000004,5.8209999999999997,51]

{"sheet":"Round 5","index":5,"n_rows":17,"n_cols":7,"rows_kept":17,"cut":false,"hidden":false,"merged":[[1,1,1,6]]}
[]
[null,{"$f":"SeriesName & \" - Round 5\"","v":"2013 Touring Car Series - Round 5"}]
[null,"Position","Driver","Laps","Fastest Lap","Fastest Lap Bonus","Points"]
[null,null,null,null,null,{"$f":"IF(C4<>\"\",IF(AND(E4=MIN($E$4:$E$15),E4>0),1,0),\"\")","v":""},{"$f":"IF(ISNA(VLOOKUP(B4,Points,2,FALSE)),\"\",VLOOKUP(B4,Points,2,FALSE)+F4)","v":""}]
[null,null,null,null,null,{"$f":"IF(C5<>\"\",IF(AND(E5=MIN($E$4:$E$15),E5>0),1,0),\"\")","v":""},""]
[null,null,null,null,null,"",""]
[null,null,null,null,null,"",""]
[null,null,null,null,null,"",""]
[null,null,null,null,null,"",""]
[null,null,null,null,null,"",""]
[null,null,null,null,null,"",""]
[null,null,null,null,null,"",""]
[null,null,null,null,null,"",""]
[null,null,null,null,null,"",""]
[null,null,null,null,null,"",""]
[]
[null,"Driver","Lane","Slowest Lap Time","Fastest Lap Time","Average Lap Time","Total Laps"]

{"sheet":"Round 6","index":6,"n_rows":17,"n_cols":7,"rows_kept":17,"cut":false,"hidden":false,"merged":[[1,1,1,6]]}
[]
[null,{"$f":"SeriesName & \" - Round 6\"","v":"2013 Touring Car Series - Round 6"}]
[null,"Position","Driver","Laps","Fastest Lap","Fastest Lap Bonus","Points"]
[null,null,null,null,null,{"$f":"IF(C4<>\"\",IF(AND(E4=MIN($E$4:$E$15),E4>0),1,0),\"\")","v":""},{"$f":"IF(ISNA(VLOOKUP(B4,Points,2,FALSE)),\"\",VLOOKUP(B4,Points,2,FALSE)+F4)","v":""}]
[null,null,null,null,null,{"$f":"IF(C5<>\"\",IF(AND(E5=MIN($E$4:$E$15),E5>0),1,0),\"\")","v":""},""]
[null,null,null,null,null,"",""]
[null,null,null,null,null,"",""]
[null,null,null,null,null,"",""]
[null,null,null,null,null,"",""]
[null,null,null,null,null,"",""]
[null,null,null,null,null,"",""]
[null,null,null,null,null,"",""]
[null,null,null,null,null,"",""]
[null,null,null,null,null,"",""]
[null,null,null,null,null,"",""]
[]
[null,"Driver","Lane","Slowest Lap Time","Fastest Lap Time","Average Lap Time","Total Laps"]

{"sheet":"SumSheet","index":7,"n_rows":41,"n_cols":64,"rows_kept":41,"cut":false,"hidden":false,"merged":[[1,51,1,54],[1,55,1,60],[23,1,23,2],[1,1,2,1],[1,47,1,50],[1,2,1,6],[1,15,1,22],[1,7,1,14],[1,23,1,30],[1,31,1,38],[1,39,1,46]]}
[null,1,2,3,4,5,6,7,8,9,10,11,12,13,14,15,16,17,18,19,20,21,22,23,24,25,26,27,28,29,30,31,32,33,34,35,36,37,38,39,40,41,42,43,44,45,46,47,48,49,50,51,52,53,54,55,56,57,58,59,60]
[null,"Racer","Round 1",null,null,null,null,"Round 2",null,null,null,null,null,null,null,"Round 3",null,null,null,null,null,null,null,"Round 4",null,null,null,null,null,null,null,"Round 5",null,null,null,null,null,null,null,"Round 6",null,null,null,null,null,null,null,"Total",null,null,null,"Dropped Round",null,null,null,"Final Classification"]
[null,null,"Laps","Points","Fastest Lap","Total Round Points","Rank","Laps","Points","Fastest Lap","Total Round Points","Rank","Running Series Points","Running Series Rank","Change in Rank","Laps","Points","Fastest Lap","Total Round Points","Rank","Running Series Points","Running Series Rank","Change in Rank","Laps","Points","Fastest Lap","Total Round Points","Rank","Running Series Points","Running Series Rank","Change in Rank","Laps","Points","Fastest Lap","Total Round Points","Rank","Running Series Points","Running Series Rank","Change in Rank","Laps","Points","Fastest Lap","Total Round Points","Rank","Running Series Points","Running Series Rank","Change in Rank","Rounds Run","Points","Fastest Laps","Laps","Round","Points","Fastest Laps","Laps","Points","Fastest Laps","Total Points","Laps","Rank","Change in Rank"]
[null,"Ary B.",{"$f":"IF(ISNA(VLOOKUP($B4,Round1Results,2,FALSE)),0,VLOOKUP($B4,Round1Results,2,FALSE))","v":0},{"$f":"IF(ISNA(VLOOKUP($B4,Round1Results,5,FALSE)),0,VLOOKUP($B4,Round1Results,5,FALSE)-E4)","v":0},{"$f":"IF(ISNA(VLOOKUP($B4,Round1Results,4,FALSE)),0,VLOOKUP($B4,Round1Results,4,FALSE))","v":0},{"$f":"SUM(D4:E4)","v":0},{"$f":"IF(C4>0,RANK(F4,F$4:F$19),0)","v":0},{"$f":"IF(ISNA(VLOOKUP($B4,Round2Results,2,FALSE)),0,VLOOKUP($B4,Round2Results,2,FALSE))","v":210.8},{"$f":"IF(ISNA(VLOOKUP($B4,Round2Results,5,FALSE)),0,VLOOKUP($B4,Round2Results,5,FALSE)-J4)","v":7},{"$f":"IF(ISNA(VLOOKUP($B4,Round2Results,4,FALSE)),0,VLOOKUP($B4,Round2Results,4,FALSE))","v":0},{"$f":"SUM(I4:J4)","v":7},{"$f":"IF(H4>0,RANK(K4,K$4:K$19),\"-\")","v":4},{"$f":"F4+K4","v":7},{"$f":"RANK(M4,M$4:M$19)","v":7},{"$f":"IF(G4=0,0,G4-N4)","v":0},{"$f":"IF(ISNA(VLOOKUP($B4,Round3Results,2,FALSE)),0,VLOOKUP($B4,Round3Results,2,FALSE))","v":216.91},{"$f":"IF(ISNA(VLOOKUP($B4,Round3Results,5,FALSE)),0,VLOOKUP($B4,Round3Results,5,FALSE)-R4)","v":9},{"$f":"IF(ISNA(VLOOKUP($B4,Round3Results,4,FALSE)),0,VLOOKUP($B4,Round3Results,4,FALSE))","v":0},{"$f":"SUM(Q4:R4)","v":9},{"$f":"IF(P4>0,RANK(S4,S$4:S$19),\"-\")","v":2},{"$f":"M4+S4","v":16},{"$f":"RANK(U4,U$4:U$19)","v":4},{"$f":"IF(N4=0,0,N4-V4)","v":3},{"$f":"IF(ISNA(VLOOKUP($B4,Round4Results,2,FALSE)),0,VLOOKUP($B4,Round4Results,2,FALSE))","v":215.5},{"$f":"IF(ISNA(VLOOKUP($B4,Round4Results,5,FALSE)),0,VLOOKUP($B4,Round4Results,5,FALSE)-Z4)","v":7},{"$f":"IF(ISNA(VLOOKUP($B4,Round4Results,4,FALSE)),0,VLOOKUP($B4,Round4Results,4,FALSE))","v":0},{"$f":"SUM(Y4:Z4)","v":7},{"$f":"IF(X4>0,RANK(AA4,AA$4:AA$19),\"-\")","v":4},{"$f":"U4+AA4","v":23},{"$f":"RANK(AC4,AC$4:AC$19)","v":5},{"$f":"IF(V4=0,0,V4-AD4)","v":-1},{"$f":"IF(ISNA(VLOOKUP($B4,Round5Results,2,FALSE)),0,VLOOKUP($B4,Round5Results,2,FALSE))","v":0},{"$f":"IF(ISNA(VLOOKUP($B4,Round5Results,5,FALSE)),0,VLOOKUP($B4,Round5Results,5,FALSE)-AH4)","v":0},{"$f":"IF(ISNA(VLOOKUP($B4,Round5Results,4,FALSE)),0,VLOOKUP($B4,Round5Results,4,FALSE))","v":0},{"$f":"SUM(AG4:AH4)","v":0},{"$f":"IF(AF4>0,RANK(AI4,AI$4:AI$19),\"-\")","v":"-"},{"$f":"AC4+AI4","v":23},{"$f":"RANK(AK4,AK$4:AK$19)","v":5},{"$f":"IF(AD4=0,0,AD4-AL4)","v":0},{"$f":"IF(ISNA(VLOOKUP($B4,Round6Results,2,FALSE)),0,VLOOKUP($B4,Round6Results,2,FALSE))","v":0},{"$f":"IF(ISNA(VLOOKUP($B4,Round6Results,5,FALSE)),0,VLOOKUP($B4,Round6Results,5,FALSE)-AP)","v":0},{"$f":"IF(ISNA(VLOOKUP($B4,Round6Results,4,FALSE)),0,VLOOKUP($B4,Round6Results,4,FALSE))","v":0},{"$f":"SUM(AO4:AP4)","v":0},{"$f":"IF(AN4>0,RANK(AQ4,AQ$4:AQ$19),\"-\")","v":"-"},{"$f":"AK4+AQ4","v":23},{"$f":"RANK(AS4,AS$4:AS$19)","v":5},{"$f":"IF(AL4=0,0,AL4-AT4)","v":0},{"$f":"COUNTIF(C4,\">0\")+COUNTIF(H4,\">0\")+COUNTIF(P4,\">0\")+COUNTIF(X4,\">0\")+COUNTIF(AF4,\">0\")+COUNTIF(AN4,\">0\")","v":3},{"$f":"D4+I4+Q4+Y4+AG4+AO4","v":23},0,{"$f":"C4+H4+P4+X4+AF4+AN4","v":643.21},null,0,0,0,{"$f":"D4+I4+Q4+Y4+AG4+AO4-BA4","v":23},{"$f":"E4+J4+R4+Z4+AH4+AP4-BB4","v":0},{"$f":"BD4+BE4","v":23},{"$f":"C4+H4+P4+X4+AF4+AN4-BC4","v":643.21},{"$f":"IF(AV4>0,RANK(BF4,$BF$4:$BF$19)+SUMPRODUCT(--($BF$4:$BF$19=BF4),--($BG$4:$BG$19>BG4)),0)","v":5},{"$f":"IF(B4<>\"\",IF(IF(RoundsRun=2,VLOOKUP(B4,SeriesSummary,14,FALSE),IF(RoundsRun=3,VLOOKUP(B4,SeriesSummary,22,FALSE),IF(RoundsRun=4,VLOOKUP(B4,SeriesSummary,30,FALSE),IF(RoundsRun=5,VLOOKUP(B4,SeriesSummary,38,FALSE),IF(RoundsRun=6,VLOOKUP(B4,SeriesSummary,46,FALSE),\"-\")))))>0,\"+\"&IF(RoundsRun=2,VLOOKUP(B4,SeriesSummary,14,FALSE),IF(RoundsRun=3,VLOOKUP(B4,SeriesSummary,22,FALSE),IF(RoundsRun=4,VLOOKUP(B4,SeriesSummary,30,FALSE),IF(RoundsRun=5,VLOOKUP(B4,SeriesSummary,38,FALSE),IF(RoundsRun=6,VLOOKUP(B4,SeriesSummary,46,FALSE),\"-\"))))),IF((IF(RoundsRun=2,VLOOKUP(B4,SeriesSummary,14,FALSE),IF(RoundsRun=3,VLOOKUP(B4,SeriesSummary,22,FALSE),IF(RoundsRun=4,VLOOKUP(B4,SeriesSummary,30,FALSE),IF(RoundsRun=5,VLOOKUP(B4,SeriesSummary,38,FALSE),IF(RoundsRun=6,VLOOKUP(B4,SeriesSummary,46,FALSE),\"-\"))))))=0,\"-\",(IF(RoundsRun=2,VLOOKUP(B4,SeriesSummary,14,FALSE),IF(RoundsRun=3,VLOOKUP(B4,SeriesSummary,22,FALSE),IF(RoundsRun=4,VLOOKUP(B4,SeriesSummary,30,FALSE),IF(RoundsRun=5,VLOOKUP(B4,SeriesSummary,38,FALSE),IF(RoundsRun=6,VLOOKUP(B4,SeriesSummary,46,FALSE),\"-\")))))))),\"\")","v":-1},null,{"$f":"BH4","v":5},{"$f":"B4","v":"Ary B."}]
[null,"Austin C.",166.55,4,0,{"$f":"SUM(D5:E5)","v":4},{"$f":"IF(C5>0,RANK(F5,F$4:F$19),0)","v":7},0,0,0,{"$f":"SUM(I5:J5)","v":0},{"$f":"IF(H5>0,RANK(K5,K$4:K$19),\"-\")","v":"-"},{"$f":"F5+K5","v":4},{"$f":"RANK(M5,M$4:M$19)","v":10},{"$f":"IF(G5=0,0,G5-N5)","v":-3},182.24,6,0,{"$f":"SUM(Q5:R5)","v":6},{"$f":"IF(P5>0,RANK(S5,S$4:S$19),\"-\")","v":5},{"$f":"M5+S5","v":10},{"$f":"RANK(U5,U$4:U$19)","v":8},{"$f":"IF(N5=0,0,N5-V5)","v":2},173.82,4,0,{"$f":"SUM(Y5:Z5)","v":4},{"$f":"IF(X5>0,RANK(AA5,AA$4:AA$19),\"-\")","v":7},{"$f":"U5+AA5","v":14},{"$f":"RANK(AC5,AC$4:AC$19)","v":8},{"$f":"IF(V5=0,0,V5-AD5)","v":0},0,0,0,{"$f":"SUM(AG5:AH5)","v":0},{"$f":"IF(AF5>0,RANK(AI5,AI$4:AI$19),\"-\")","v":"-"},{"$f":"AC5+AI5","v":14},{"$f":"RANK(AK5,AK$4:AK$19)","v":8},{"$f":"IF(AD5=0,0,AD5-AL5)","v":0},0,{"$f":"IF(ISNA(VLOOKUP($B5,Round6Results,5,FALSE)),0,VLOOKUP($B5,Round6Results,5,FALSE)-AP)","v":0},0,{"$f":"SUM(AO5:AP5)","v":0},{"$f":"IF(AN5>0,RANK(AQ5,AQ$4:AQ$19),\"-\")","v":"-"},{"$f":"AK5+AQ5","v":14},{"$f":"RANK(AS5,AS$4:AS$19)","v":8},{"$f":"IF(AL5=0,0,AL5-AT5)","v":0},3,14,0,522.61,null,0,0,0,{"$f":"D5+I5+Q5+Y5+AG5+AO5-BA5","v":14},0,{"$f":"BD5+BE5","v":14},522.61,{"$f":"IF(AV5>0,RANK(BF5,$BF$4:$BF$19)+SUMPRODUCT(--($BF$4:$BF$19=BF5),--($BG$4:$BG$19>BG5)),0)","v":8},"-",null,{"$f":"BH5","v":8},{"$f":"B5","v":"Austin C."}]
[null,"Bob L.",0,0,0,0,0,0,0,0,0,"-",{"$f":"F6+K6","v":0},12,{"$f":"IF(G6=0,0,G6-N6)","v":0},0,0,0,0,"-",{"$f":"M6+S6","v":0},12,{"$f":"IF(N6=0,0,N6-V6)","v":0},0,0,0,0,"-",{"$f":"U6+AA6","v":0},12,{"$f":"IF(V6=0,0,V6-AD6)","v":0},0,0,0,0,"-",{"$f":"AC6+AI6","v":0},12,{"$f":"IF(AD6=0,0,AD6-AL6)","v":0},0,{"$f":"IF(ISNA(VLOOKUP($B6,Round6Results,5,FALSE)),0,VLOOKUP($B6,Round6Results,5,FALSE)-AP)","v":0},0,0,"-",{"$f":"AK6+AQ6","v":0},12,{"$f":"IF(AL6=0,0,AL6-AT6)","v":0},0,0,0,0,null,0,0,0,0,0,0,0,0,"-",null,0,"Bob L."]
[null,"Brandon M.",0,0,0,0,0,183.75,3,0,3,8,{"$f":"F7+K7","v":3},11,{"$f":"IF(G7=0,0,G7-N7)","v":0},0,0,0,0,"-",{"$f":"M7+S7","v":3},11,{"$f":"IF(N7=0,0,N7-V7)","v":0},0,0,0,0,"-",{"$f":"U7+AA7","v":3},11,{"$f":"IF(V7=0,0,V7-AD7)","v":0},0,0,0,0,"-",{"$f":"AC7+AI7","v":3},11,{"$f":"IF(AD7=0,0,AD7-AL7)","v":0},0,{"$f":"IF(ISNA(VLOOKUP($B7,Round6Results,5,FALSE)),0,VLOOKUP($B7,Round6Results,5,FALSE)-AP)","v":0},0,0,"-",{"$f":"AK7+AQ7","v":3},11,{"$f":"IF(AL7=0,0,AL7-AT7)","v":0},1,3,0,183.75,null,0,0,0,3,0,3,183.75,11,"-",null,11,"Brandon M."]
[null,"Brett L.",137.80000000000001,3,0,3,8,145.19999999999999,2,0,2,9,5,8,0,0,0,0,0,"-",5,9,-1,161.85,3,0,3,8,8,9,0,0,0,0,0,"-",8,9,0,0,{"$f":"IF(ISNA(VLOOKUP($B8,Round6Results,5,FALSE)),0,VLOOKUP($B8,Round6Results,5,FALSE)-AP)","v":0},0,0,"-",8,9,0,3,8,0,444.85,null,0,0,0,8,0,8,444.85,9,"-",null,9,"Brett L."]
[null,"Brian H.",175.95,6,0,6,5,195.86,6,0,6,5,12,4,1,0,0,0,0,"-",12,7,-3,197.23,5,0,5,6,17,6,1,0,0,0,0,"-",17,6,0,0,{"$f":"IF(ISNA(VLOOKUP($B9,Round6Results,5,FALSE)),0,VLOOKUP($B9,Round6Results,5,FALSE)-AP)","v":0},0,0,"-",17,6,0,3,17,0,569.04,null,0,0,0,17,0,17,569.04,6,"+1",null,6,"Brian H."]
[null,"Jim J.",187.52,7,0,7,4,188.41,4,0,4,7,11,5,-1,25,5,0,5,6,16,4,1,0,0,0,0,"-",16,7,-3,0,0,0,0,"-",16,7,0,0,{"$f":"IF(ISNA(VLOOKUP($B10,Round6Results,5,FALSE)),0,VLOOKUP($B10,Round6Results,5,FALSE)-AP)","v":0},0,0,"-",16,7,0,3,16,0,400.93,null,0,0,0,16,0,16,400.93,7,-3,null,7,"Jim J."]
[null,"Kevin F.",0,0,0,0,0,0,0,0,0,"-",0,12,0,0,0,0,0,"-",0,12,0,0,0,0,0,"-",0,12,0,0,0,0,0,"-",0,12,0,0,{"$f":"IF(ISNA(VLOOKUP($B11,Round6Results,5,FALSE)),0,VLOOKUP($B11,Round6Results,5,FALSE)-AP)","v":0},0,0,"-",0,12,0,0,0,0,0,null,0,0,0,0,0,0,0,0,"-",null,0,"Kevin F."]
[null,"Marty M.",209.87,8,0,8,3,0,0,0,0,"-",8,6,-3,211.45,7,0,7,4,15,6,0,217.3,9,1,10,1,25,4,2,0,0,0,0,"-",25,4,0,0,{"$f":"IF(ISNA(VLOOKUP($B12,Round6Results,5,FALSE)),0,VLOOKUP($B12,Round6Results,5,FALSE)-AP)","v":0},0,0,"-",25,4,0,3,24,1,638.62,null,{"$f":"MIN(D12,I12,Q12,Y12,AG12,AO12)","v":0},0,0,24,1,25,638.62,4,"+2",null,4,"Marty M."]
[null,"Roy M.",167.8,5,0,{"$f":"SUM(D13:E13)","v":5},6,211.4,8,0,{"$f":"SUM(I13:J13)","v":8},3,13,3,3,212.24,8,0,{"$f":"SUM(Q13:R13)","v":8},3,21,2,1,212.12,6,0,{"$f":"SUM(Y13:Z13)","v":6},5,27,3,-1,0,0,0,{"$f":"SUM(AG13:AH13)","v":0},"-",27,3,0,0,{"$f":"IF(ISNA(VLOOKUP($B13,Round6Results,5,FALSE)),0,VLOOKUP($B13,Round6Results,5,FALSE)-AP)","v":0},0,{"$f":"SUM(AO13:AP13)","v":0},"-",27,3,0,4,27,0,803.56000000000006,null,0,0,0,27,0,27,803.56000000000006,3,-1,null,3,"Roy M."]
[null,"Russell M.",216.82,10,1,11,1,212.47,9,0,9,2,20,1,0,218.27,10,1,11,1,31,1,0,217.37,10,0,10,1,41,1,0,0,0,0,0,"-",41,1,0,0,{"$f":"IF(ISNA(VLOOKUP($B14,Round6Results,5,FALSE)),0,VLOOKUP($B14,Round6Results,5,FALSE)-AP)","v":0},0,0,"-",41,1,0,4,39,2,864.93,null,{"$f":"MIN(D14,I14,Q14,Y14,AG14,AO14)","v":0},0,0,39,2,41,864.93,1,"-",null,1,"Russell M."]
[null,"Shawn G.",212.28,9,0,9,2,218.46,10,1,11,1,20,1,1,0,0,0,0,"-",20,3,-2,216.6,8,0,8,3,28,2,1,0,0,0,0,"-",28,2,0,0,{"$f":"IF(ISNA(VLOOKUP($B15,Round6Results,5,FALSE)),0,VLOOKUP($B15,Round6Results,5,FALSE)-AP)","v":0},0,0,"-",28,2,0,3,27,1,647.34,null,0,0,0,27,1,28,647.34,2,"+1",null,2,"Shawn G."]
[null,"Stephen B.",0,0,0,0,0,192.35,5,0,5,6,5,8,0,0,0,0,0,"-",5,9,-1,0,0,0,0,"-",5,10,-1,0,0,0,0,"-",5,10,0,0,{"$f":"IF(ISNA(VLOOKUP($B16,Round6Results,5,FALSE)),0,VLOOKUP($B16,Round6Results,5,FALSE)-AP)","v":0},0,0,"-",5,10,0,1,5,0,192.35,null,0,0,0,5,0,5,192.35,10,-1,null,10,"Stephen B."]
[null,null,0,0,0,0,0,0,0,0,0,"-",0,12,0,0,0,0,0,"-",0,12,0,0,0,0,0,"-",0,12,0,0,0,0,0,"-",0,12,0,0,{"$f":"IF(ISNA(VLOOKUP($B17,Round6Results,5,FALSE)),0,VLOOKUP($B17,Round6Results,5,FALSE)-AP)","v":0},0,0,"-",0,12,0,0,0,0,0,null,0,0,0,0,0,0,0,0,"",null,0,0]
[null,null,0,0,0,0,{"$f":"IF(C18>0,RANK(F18,F$4:F$19),0)","v":0},0,0,0,0,{"$f":"IF(H18>0,RANK(K18,K$4:K$19),\"-\")","v":"-"},0,{"$f":"RANK(M18,M$4:M$19)","v":12},0,0,0,0,0,{"$f":"IF(P18>0,RANK(S18,S$4:S$19),\"-\")","v":"-"},0,{"$f":"RANK(U18,U$4:U$19)","v":12},0,0,0,0,0,{"$f":"IF(X18>0,RANK(AA18,AA$4:AA$19),\"-\")","v":"-"},0,{"$f":"RANK(AC18,AC$4:AC$19)","v":12},0,0,0,0,0,{"$f":"IF(AF18>0,RANK(AI18,AI$4:AI$19),\"-\")","v":"-"},0,{"$f":"RANK(AK18,AK$4:AK$19)","v":12},0,0,{"$f":"IF(ISNA(VLOOKUP($B18,Round6Results,5,FALSE)),0,VLOOKUP($B18,Round6Results,5,FALSE)-AP)","v":0},0,0,{"$f":"IF(AN18>0,RANK(AQ18,AQ$4:AQ$19),\"-\")","v":"-"},0,{"$f":"RANK(AS18,AS$4:AS$19)","v":12},0,0,0,0,0,null,0,0,0,0,0,0,0,0,"",null,0,0]
[null,null,0,0,0,0,{"$f":"IF(C19>0,RANK(F19,F$4:F$19),0)","v":0},0,0,0,0,{"$f":"IF(H19>0,RANK(K19,K$4:K$19),\"-\")","v":"-"},0,{"$f":"RANK(M19,M$4:M$19)","v":12},0,0,0,0,0,{"$f":"IF(P19>0,RANK(S19,S$4:S$19),\"-\")","v":"-"},0,{"$f":"RANK(U19,U$4:U$19)","v":12},0,0,0,0,0,{"$f":"IF(X19>0,RANK(AA19,AA$4:AA$19),\"-\")","v":"-"},0,{"$f":"RANK(AC19,AC$4:AC$19)","v":12},0,0,0,0,0,{"$f":"IF(AF19>0,RANK(AI19,AI$4:AI$19),\"-\")","v":"-"},0,{"$f":"RANK(AK19,AK$4:AK$19)","v":12},0,0,{"$f":"IF(ISNA(VLOOKUP($B19,Round6Results,5,FALSE)),0,VLOOKUP($B19,Round6Results,5,FALSE)-AP)","v":0},0,0,{"$f":"IF(AN19>0,RANK(AQ19,AQ$4:AQ$19),\"-\")","v":"-"},0,{"$f":"RANK(AS19,AS$4:AS$19)","v":12},0,0,0,0,0,null,0,0,0,0,0,0,0,0,"",null,0,0]
[]
[]
[null,"Series Name","2013 Touring Car Series"]
[null,"Rounds Run",{"$f":"COUNT('Round 1'!B4,'Round 2'!B4,'Round 3'!B4,'Round 4'!B4,'Round 5'!B4,'Round 6'!B4)","v":4}]
[null,"Points Table"]
[null,"Position","Points"]
[null,1,10]
[null,2,9]
[null,3,8]
[null,4,7]
[null,5,6]
[null,6,5]
[null,7,4]
[null,8,3]
[null,9,2]
[null,10,1]
[null,11,1]
[null,12,1]
[null,13,1]
[null,14,1]
[null,15,1]
[null,16,1]