{"text_format":"1","workbook":"xlsx","n_sheets":8,"sheets":["Leader Board","Round 1","Round 2","Round 3","Round 4","Round 5","Round 6","SumSheet"],"not_rendered":{"charts":0,"images":0,"macros":1,"external_links":0,"defined_names":23,"comments":0,"pivot_tables":0},"unopened":[],"bounds":{"document_bytes":16777216,"sheet_cells":100000,"rows_first":2000,"rows_last":500,"rows_between":2000,"halvings":0,"cell_chars":16384,"cell_head_chars":4096},"cells_cut":0,"cells_raw":0,"read":"whole","date_system":"1904"}

{"sheet":"Leader Board","index":0,"n_rows":17,"n_cols":13,"rows_kept":17,"cut":false,"hidden":false,"merged":[[1,1,1,8],[1,12,1,19]]}
[null,null,null,null,null,null,null,null,null,null,null,null,"Used to reformat the leader board after resorting the results. DO NOT MODIFY"]
[null,{"$f":" SeriesName & \" - Round \" & RoundsRun & \" of 6  (Overall)\"","v":"2013 Scalextric GT - Round 6 of 6  (Overall)"}]
[null,"Position","+/-","Driver","Points","Behind","Starts","Laps","Fastest Laps"]
[null,{"$f":"IF(ISNA(VLOOKUP($D4,SeriesSummary,59,FALSE)),\"\",VLOOKUP($D4,SeriesSummary,59,FALSE))","v":1},{"$f":"IF(ISNA(VLOOKUP($D4,SeriesSummary,60,FALSE)),\"\",VLOOKUP($D4,SeriesSummary,60,FALSE))","v":"-"},{"$f":"IF(SumSheet!AV16>0,SumSheet!B16,\"\")","v":"Shawn G."},{"$f":"IF(D4<>\"\",IF(ISNA(VLOOKUP($D4,SeriesSummary,57,FALSE)),\"-\",VLOOKUP($D4,SeriesSummary,57,FALSE)),\"\")","v":51},"Leader",{"$f":"IF(ISNA(VLOOKUP($D4,SeriesSummary,47,FALSE)),\"\",VLOOKUP($D4,SeriesSummary,47,FALSE))","v":5},{"$f":"IF(ISNA(VLOOKUP($D4,SeriesSummary,58,FALSE)),\"\",VLOOKUP($D4,SeriesSummary,58,FALSE))","v":1070.3499999999999},{"$f":"IF(ISNA(VLOOKUP($D4,SeriesSummary,56,FALSE)),\"\",VLOOKUP($D4,SeriesSummary,56,FALSE))","v":1}]
[null,{"$f":"IF(ISNA(VLOOKUP($D5,SeriesSummary,59,FALSE)),\"\",VLOOKUP($D5,SeriesSummary,59,FALSE))","v":2},{"$f":"IF(ISNA(VLOOKUP($D5,SeriesSummary,60,FALSE)),\"\",VLOOKUP($D5,SeriesSummary,60,FALSE))","v":"-"},{"$f":"IF(SumSheet!AV4>0,SumSheet!B4,\"\")","v":"Ary B."},40,{"$f":"IF(ISERROR(E5-$E$4),\"\",E5-$E$4)","v":-11},5,1030.07,1]
[null,{"$f":"IF(ISNA(VLOOKUP($D6,SeriesSummary,59,FALSE)),\"\",VLOOKUP($D6,SeriesSummary,59,FALSE))","v":3},{"$f":"IF(ISNA(VLOOKUP($D6,SeriesSummary,60,FALSE)),\"\",VLOOKUP($D6,SeriesSummary,60,FALSE))","v":"-"},{"$f":"IF(SumSheet!AV12>0,SumSheet!B12,\"\")","v":"Marty M."},39,{"$f":"IF(ISERROR(E6-$E$4),\"\",E6-$E$4)","v":-12},4,852.5,3]
[null,{"$f":"IF(ISNA(VLOOKUP($D7,SeriesSummary,59,FALSE)),\"\",VLOOKUP($D7,SeriesSummary,59,FALSE))","v":4},{"$f":"IF(ISNA(VLOOKUP($D7,SeriesSummary,60,FALSE)),\"\",VLOOKUP($D7,SeriesSummary,60,FALSE))","v":-1},{"$f":"IF(SumSheet!AV9>0,SumSheet!B9,\"\")","v":"Brian H."},37,-14,5,1032.8499999999999,1]
[null,{"$f":"IF(ISNA(VLOOKUP($D8,SeriesSummary,59,FALSE)),\"\",VLOOKUP($D8,SeriesSummary,59,FALSE))","v":5},{"$f":"IF(ISNA(VLOOKUP($D8,SeriesSummary,60,FALSE)),\"\",VLOOKUP($D8,SeriesSummary,60,FALSE))","v":-2},{"$f":"IF(SumSheet!AV15>0,SumSheet!B15,\"\")","v":"Russell M."},36,-15,5,1020.6700000000001,0]
[null,{"$f":"IF(ISNA(VLOOKUP($D9,SeriesSummary,59,FALSE)),\"\",VLOOKUP($D9,SeriesSummary,59,FALSE))","v":6},{"$f":"IF(ISNA(VLOOKUP($D9,SeriesSummary,60,FALSE)),\"\",VLOOKUP($D9,SeriesSummary,60,FALSE))","v":"-"},{"$f":"IF(SumSheet!AV13>0,SumSheet!B13,\"\")","v":"Rich C."},28,-23,6,1141,0]
[null,{"$f":"IF(ISNA(VLOOKUP($D10,SeriesSummary,59,FALSE)),\"\",VLOOKUP($D10,SeriesSummary,59,FALSE))","v":7},{"$f":"IF(ISNA(VLOOKUP($D10,SeriesSummary,60,FALSE)),\"\",VLOOKUP($D10,SeriesSummary,60,FALSE))","v":"-"},{"$f":"IF(SumSheet!AV17>0,SumSheet!B17,\"\")","v":"Stephen B."},24,-27,5,940.47,0]
[null,{"$f":"IF(ISNA(VLOOKUP($D11,SeriesSummary,59,FALSE)),\"\",VLOOKUP($D11,SeriesSummary,59,FALSE))","v":8},{"$f":"IF(ISNA(VLOOKUP($D11,SeriesSummary,60,FALSE)),\"\",VLOOKUP($D11,SeriesSummary,60,FALSE))","v":"-"},{"$f":"IF(SumSheet!AV14>0,SumSheet!B14,\"\")","v":"Roy M."},21,-30,3,611.02,0]
[null,{"$f":"IF(ISNA(VLOOKUP($D12,SeriesSummary,59,FALSE)),\"\",VLOOKUP($D12,SeriesSummary,59,FALSE))","v":9},{"$f":"IF(ISNA(VLOOKUP($D12,SeriesSummary,60,FALSE)),\"\",VLOOKUP($D12,SeriesSummary,60,FALSE))","v":"-"},{"$f":"IF(SumSheet!AV5>0,SumSheet!B5,\"\")","v":"Austin C."},12,-39,3,582.01,0]
[null,{"$f":"IF(ISNA(VLOOKUP($D13,SeriesSummary,59,FALSE)),\"\",VLOOKUP($D13,SeriesSummary,59,FALSE))","v":10},{"$f":"IF(ISNA(VLOOKUP($D13,SeriesSummary,60,FALSE)),\"\",VLOOKUP($D13,SeriesSummary,60,FALSE))","v":"-"},{"$f":"IF(SumSheet!AV8>0,SumSheet!B8,\"\")","v":"Brett L."},10,-41,2,359.65,0]
[null,{"$f":"IF(ISNA(VLOOKUP($D14,SeriesSummary,59,FALSE)),\"\",VLOOKUP($D14,SeriesSummary,59,FALSE))","v":""},{"$f":"IF(ISNA(VLOOKUP($D14,SeriesSummary,60,FALSE)),\"\",VLOOKUP($D14,SeriesSummary,60,FALSE))","v":""},{"$f":"IF(SumSheet!AV10>0,SumSheet!B10,\"\")","v":""},"","","","",""]
[null,{"$f":"IF(ISNA(VLOOKUP($D15,SeriesSummary,59,FALSE)),\"\",VLOOKUP($D15,SeriesSummary,59,FALSE))","v":""},{"$f":"IF(ISNA(VLOOKUP($D15,SeriesSummary,60,FALSE)),\"\",VLOOKUP($D15,SeriesSummary,60,FALSE))","v":""},{"$f":"IF(SumSheet!AV6>0,SumSheet!B6,\"\")","v":""},"","","","",""]
[null,{"$f":"IF(ISNA(VLOOKUP($D16,SeriesSummary,59,FALSE)),\"\",VLOOKUP($D16,SeriesSummary,59,FALSE))","v":""},{"$f":"IF(ISNA(VLOOKUP($D16,SeriesSummary,60,FALSE)),\"\",VLOOKUP($D16,SeriesSummary,60,FALSE))","v":""},{"$f":"IF(SumSheet!AV7>0,SumSheet!B7,\"\")","v":""},"","","","",""]
[null,{"$f":"IF(ISNA(VLOOKUP($D17,SeriesSummary,59,FALSE)),\"\",VLOOKUP($D17,SeriesSummary,59,FALSE))","v":""},{"$f":"IF(ISNA(VLOOKUP($D17,SeriesSummary,60,FALSE)),\"\",VLOOKUP($D17,SeriesSummary,60,FALSE))","v":""},{"$f":"IF(SumSheet!AV11>0,SumSheet!B11,\"\")","v":""},"","","","",""]

{"sheet":"Round 1","index":1,"n_rows":32,"n_cols":7,"rows_kept":32,"cut":false,"hidden":false,"merged":[[1,1,1,6]]}
[]
[null,{"$f":"SeriesName & \" - Round 1\"","v":"2013 Scalextric GT - Round 1"}]
[null,"Position","Driver","Laps","Fastest Lap","Fastest Lap Bonus","Points"]
[null,1,"Shawn G.",209.66,4.1829999999999998,{"$f":"IF(C4<>\"\",IF(AND(E4=MIN($E$4:$E$15),E4>0),1,0),\"\")","v":1},{"$f":"IF(ISNA(VLOOKUP(B4,Points,2,FALSE)),\"\",VLOOKUP(B4,Points,2,FALSE)+F4)","v":11}]
[null,2,"Roy M.",204.41,4.2480000000000002,{"$f":"IF(C5<>\"\",IF(AND(E5=MIN($E$4:$E$15),E5>0),1,0),\"\")","v":0},9]
[null,3,"Stephen B.",199.74,4.2779999999999996,0,8]
[null,4,"Ary B.",191.76,4.2089999999999996,0,7]
[null,5,"Rich C.",189.9,4.4749999999999996,0,6]
[null,null,null,null,null,"",""]
[null,null,null,null,null,"",""]
[null,null,null,null,null,"",""]
[null,null,null,null,null,"",""]
[null,null,null,null,null,"",""]
[null,null,null,null,null,"",""]
[null,null,null,null,null,"",""]
[]
[null,"Driver","Lane","Slowest Lap Time","Fastest Lap Time","Average Lap Time","Total Laps"]
[null,"Shawn G.",1,4.9210000000000003,4.1829999999999998,4.2830000000000004,71.66]
[null,"Shawn G.",2,4.7839999999999998,4.2249999999999996,4.3090000000000002,70]
[null,"Shawn G.",3,4.4009999999999998,4.2050000000000001,4.3620000000000001,68]
[null,"Roy M.",1,5.9210000000000003,4.2699999999999996,4.4340000000000002,67.41]
[null,"Roy M.",2,5.7610000000000001,4.2480000000000002,4.3959999999999999,68]
[null,"Roy M.",3,5.3620000000000001,4.2539999999999996,4.407,69]
[null,"Stephen B.",1,4.8579999999999997,4.2779999999999996,4.42,68.739999999999995]
[null,"Stephen B.",2,6.0140000000000002,4.3879999999999999,4.6669999999999998,64]
[null,"Stephen B.",3,4.6379999999999999,4.3570000000000002,4.484,67]
[null,"Ary B.",1,4.9539999999999997,4.41,4.7249999999999996,64]
[null,"Ary B.",2,6.0030000000000001,4.2640000000000002,4.4329999999999998,67.760000000000005]
[null,"Ary B.",3,14.377000000000001,4.2089999999999996,4.84,60]
[null,"Rich C.",1,7.0170000000000003,4.4749999999999996,4.7350000000000003,63]
[null,"Rich C.",2,6.3879999999999999,4.5339999999999998,4.6749999999999998,64]
[null,"Rich C.",3,7.0430000000000001,4.5599999999999996,4.806,62.9]

{"sheet":"Round 2","index":2,"n_rows":35,"n_cols":7,"rows_kept":35,"cut":false,"hidden":false,"merged":[[1,1,1,6]]}
[]
[null,{"$f":"SeriesName & \" - Round 2\"","v":"2013 Scalextric GT - Round 2"}]
[null,"Position","Driver","Laps","Fastest Lap","Fastest Lap Bonus","Points"]
[null,1,"Shawn G.",215.8,4.0439999999999996,{"$f":"IF(C4<>\"\",IF(AND(E4=MIN($E$4:$E$15),E4>0),1,0),\"\")","v":0},{"$f":"IF(ISNA(VLOOKUP(B4,Points,2,FALSE)),\"\",VLOOKUP(B4,Points,2,FALSE)+F4)","v":10}]
[null,2,"Ary B.",213.2,3.9239999999999999,{"$f":"IF(C5<>\"\",IF(AND(E5=MIN($E$4:$E$15),E5>0),1,0),\"\")","v":1},10]
[null,3,"Brian H.",206.83,4.1150000000000002,0,8]
[null,4,"Rich C.",192.82,4.3949999999999996,0,7]
[null,5,"Russell M.",191.5,4.4240000000000004,0,6]
[null,6,"Brett L.",180.35,4.5049999999999999,0,5]
[null,null,null,null,null,"",""]
[null,null,null,null,null,"",""]
[null,null,null,null,null,"",""]
[null,null,null,null,null,"",""]
[null,null,null,null,null,"",""]
[null,null,null,null,null,"",""]
[]
[null,"Driver","Lane","Slowest Lap Time","Fastest Lap Time","Average Lap Time","Total Laps"]
[null,"Shawn G.",1,4.6790000000000003,4.0780000000000003,4.1840000000000002,71]
[null,"Shawn G.",2,4.3650000000000002,4.0540000000000003,4.194,72.8]
[null,"Shawn G.",3,4.6920000000000002,4.0439999999999996,4.1440000000000001,72]
[null,"Ary B.",1,4.99,3.9239999999999999,4.0170000000000003,74]
[null,"Ary B.",2,4.6459999999999999,4.226,4.3499999999999996,69.2]
[null,"Ary B.",3,4.766,4.2080000000000002,4.3390000000000004,70]
[null,"Brian H.",1,5.8250000000000002,4.28,4.45,67]
[null,"Brian H.",2,5.8959999999999999,4.1150000000000002,4.2750000000000004,70.83]
[null,"Brian H.",3,4.5540000000000003,4.2060000000000004,4.3419999999999996,69]
[null,"Rich C.",1,6.0670000000000002,4.4139999999999997,4.5579999999999998,66]
[null,"Rich C.",2,6.0129999999999999,4.5179999999999998,4.8049999999999997,62.82]
[null,"Rich C.",3,6.8920000000000003,4.3949999999999996,4.6639999999999997,64]
[null,"Russell M.",1,6.452,4.4850000000000003,4.7309999999999999,63]
[null,"Russell M.",2,6.6959999999999997,4.4240000000000004,4.6669999999999998,64.5]
[null,"Russell M.",3,6.2519999999999998,4.4660000000000002,4.7080000000000002,64]
[null,"Brett L.",1,7.3380000000000001,4.5229999999999997,5.0049999999999999,59]
[null,"Brett L.",2,6.89,4.5049999999999999,5.0469999999999997,60.35]
[null,"Brett L.",3,6.4039999999999999,4.5190000000000001,4.9359999999999999,61]

{"sheet":"Round 3","index":3,"n_rows":41,"n_cols":7,"rows_kept":41,"cut":false,"hidden":false,"merged":[[1,1,1,6]]}
[]
[null,{"$f":"SeriesName & \" - Round 3\"","v":"2013 Scalextric GT - Round 3"}]
[null,"Position","Driver","Laps","Fastest Lap","Fastest Lap Bonus","Points"]
[null,1,"Shawn G.",212.82,4.0940000000000003,{"$f":"IF(C4<>\"\",IF(AND(E4=MIN($E$4:$E$15),E4>0),1,0),\"\")","v":0},{"$f":"IF(ISNA(VLOOKUP(B4,Points,2,FALSE)),\"\",VLOOKUP(B4,Points,2,FALSE)+F4)","v":10}]
[null,2,"Ary B.",209.45,4.125,{"$f":"IF(C5<>\"\",IF(AND(E5=MIN($E$4:$E$15),E5>0),1,0),\"\")","v":0},9]
[null,3,"Marty M.",206.78,4.1219999999999999,0,8]
[null,4,"Russell M.",205.31,4.1379999999999999,0,7]
[null,5,"Brian H.",204.29,4.0839999999999996,1,7]
[null,6,"Rich C.",200.6,4.2590000000000003,0,5]
[null,7,"Stephen B.",200.05,4.2039999999999997,0,4]
[null,8,"Austin C.",187.79,4.3239999999999998,0,3]
[null,null,null,null,null,"",""]
[null,null,null,null,null,"",""]
[null,null,null,null,null,"",""]
[null,null,null,null,null,"",""]
[]
[null,"Driver","Lane","Slowest Lap Time","Fastest Lap Time","Average Lap Time","Total Laps"]
[null,"Shawn G.",1,4.5810000000000004,4.1399999999999997,4.24,71]
[null,"Shawn G.",2,4.5460000000000003,4.1020000000000003,4.2050000000000001,71]
[null,"Shawn G.",3,5.8490000000000002,4.0940000000000003,4.2510000000000003,70.819999999999993]
[null,"Ary B.",1,4.9470000000000001,4.125,4.234,71.45]
[null,"Ary B.",2,6.2770000000000001,4.1719999999999997,4.3049999999999997,70]
[null,"Ary B.",3,5.5679999999999996,4.2320000000000002,4.3710000000000004,68]
[null,"Marty M.",1,6.133,4.1219999999999999,4.3440000000000003,69.78]
[null,"Marty M.",2,5.8920000000000003,4.2089999999999996,4.3959999999999999,68]
[null,"Marty M.",3,4.4950000000000001,4.2149999999999999,4.3099999999999996,69]
[null,"Russell M.",1,6.5570000000000004,4.1630000000000003,4.33,69.31]
[null,"Russell M.",2,6.8849999999999998,4.1379999999999999,4.3239999999999998,70]
[null,"Russell M.",3,5.8,4.2229999999999999,4.5190000000000001,66]
[null,"Brian H.",1,12.83,4.1310000000000002,4.7750000000000004,62.29]
[null,"Brian H.",2,4.5259999999999998,4.0919999999999996,4.2229999999999999,71]
[null,"Brian H.",3,5.1449999999999996,4.0839999999999996,4.2859999999999996,71]
[null,"Rich C.",1,7.5679999999999996,4.274,4.5330000000000004,66.599999999999994]
[null,"Rich C.",2,5.99,4.2590000000000003,4.4039999999999999,68]
[null,"Rich C.",3,6.5069999999999997,4.2910000000000004,4.5359999999999996,66]
[null,"Stephen B.",1,5.673,4.2640000000000002,4.4370000000000003,67.05]
[null,"Stephen B.",2,5.99,4.2039999999999997,4.4420000000000002,68]
[null,"Stephen B.",3,6.8150000000000004,4.234,4.641,65]
[null,"Austin C.",1,7.6740000000000004,4.3250000000000002,4.9329999999999998,61]
[null,"Austin C.",2,6.9550000000000001,4.4009999999999998,4.742,63.79]
[null,"Austin C.",3,8.2629999999999999,4.3239999999999998,4.7169999999999996,63]

{"sheet":"Round 4","index":4,"n_rows":38,"n_cols":7,"rows_kept":38,"cut":false,"hidden":false,"merged":[[1,1,1,6]]}
[]
[null,{"$f":"SeriesName & \" - Round 4\"","v":"2013 Scalextric GT - Round 4"}]
[null,"Position","Driver","Laps","Fastest Lap","Fastest Lap Bonus","Points"]
[null,1,"Marty M.",216.46,3.9870000000000001,{"$f":"IF(C4<>\"\",IF(AND(E4=MIN($E$4:$E$15),E4>0),1,0),\"\")","v":1},{"$f":"IF(ISNA(VLOOKUP(B4,Points,2,FALSE)),\"\",VLOOKUP(B4,Points,2,FALSE)+F4)","v":11}]
[null,2,"Brian H.",210.97,4.0439999999999996,{"$f":"IF(C5<>\"\",IF(AND(E5=MIN($E$4:$E$15),E5>0),1,0),\"\")","v":0},9]
[null,3,"Russell M.",209.86,4.0549999999999997,0,8]
[null,4,"Ary B.",207.26,4.1509999999999998,0,7]
[null,5,"Austin C.",202.41,4.1749999999999998,0,6]
[null,6,"Stephen B.",198.44,4.1950000000000003,0,5]
[null,7,"Rich C.",196.48,4.2409999999999997,0,4]
[null,null,null,null,null,"",""]
[null,null,null,null,null,"",""]
[null,null,null,null,null,"",""]
[null,null,null,null,null,"",""]
[null,null,null,null,null,"",""]
[]
[null,"Driver","Lane","Slowest Lap Time","Fastest Lap Time","Average Lap Time","Total Laps"]
[null,"Marty M.",1,4.4420000000000002,4.0279999999999996,4.1280000000000001,73]
[null,"Marty M.",2,6.4320000000000004,3.9870000000000001,4.16,72]
[null,"Marty M.",3,5.7629999999999999,4.0229999999999997,4.194,71.459999999999994]
[null,"Brian H.",1,5.6580000000000004,4.0670000000000002,4.2510000000000003,70.97]
[null,"Brian H.",2,5.1710000000000003,4.0439999999999996,4.2430000000000003,70]
[null,"Brian H.",3,5.6109999999999998,4.05,4.3140000000000001,70]
[null,"Russell M.",1,6.5579999999999998,4.1369999999999996,4.5049999999999999,66.86]
[null,"Russell M.",2,5.2409999999999997,4.0590000000000002,4.18,71]
[null,"Russell M.",3,5.7649999999999997,4.0549999999999997,4.2130000000000001,72]
[null,"Ary B.",1,6.48,4.1509999999999998,4.3449999999999998,69.260000000000005]
[null,"Ary B.",2,4.5469999999999997,4.2110000000000003,4.3739999999999997,69]
[null,"Ary B.",3,4.5529999999999999,4.2450000000000001,4.3259999999999996,69]
[null,"Austin C.",1,4.8559999999999999,4.2939999999999996,4.4539999999999997,67.41]
[null,"Austin C.",2,7.5449999999999999,4.1749999999999998,4.4669999999999996,67]
[null,"Austin C.",3,5.1210000000000004,4.2469999999999999,4.4290000000000003,68]
[null,"Stephen B.",1,5.8259999999999996,4.202,4.55,66]
[null,"Stephen B.",2,8.5559999999999992,4.1950000000000003,4.5780000000000003,65.44]
[null,"Stephen B.",3,5.9180000000000001,4.2080000000000002,4.4889999999999999,67]
[null,"Rich C.",1,7.0049999999999999,4.2809999999999997,4.6630000000000003,64.48]
[null,"Rich C.",2,6.2590000000000003,4.2409999999999997,4.484,67]
[null,"Rich C.",3,7.0069999999999997,4.3090000000000002,4.617,65]

{"sheet":"Round 5","index":5,"n_rows":44,"n_cols":7,"rows_kept":44,"cut":false,"hidden":false,"merged":[[1,1,1,6]]}
[]
[null,{"$f":"SeriesName & \" - Round 5\"","v":"2013 Scalextric GT - Round 5"}]
[null,"Position","Driver","Laps","Fastest Lap","Fastest Lap Bonus","Points"]
[null,1,"Shawn G.",215.52,4.0209999999999999,{"$f":"IF(C4<>\"\",IF(AND(E4=MIN($E$4:$E$15),E4>0),1,0),\"\")","v":0},{"$f":"IF(ISNA(VLOOKUP(B4,Points,2,FALSE)),\"\",VLOOKUP(B4,Points,2,FALSE)+F4)","v":10}]
[null,2,"Marty M.",213.51,3.9849999999999999,{"$f":"IF(C5<>\"\",IF(AND(E5=MIN($E$4:$E$15),E5>0),1,0),\"\")","v":1},10]
[null,3,"Russell M.",210.72,4.0430000000000001,0,8]
[null,4,"Ary B.",208.4,4.1749999999999998,0,7]
[null,5,"Roy M.",206.81,4.1479999999999997,0,6]
[null,6,"Brian H.",198.29,4.1500000000000004,0,5]
[null,7,"Stephen B.",194.24,4.202,0,4]
[null,8,"Austin C.",191.81,4.2590000000000003,0,3]
[null,9,"Rich C.",182.4,4.6020000000000003,0,2]
[null,null,null,null,null,"",""]
[null,null,null,null,null,"",""]
[null,null,null,null,null,"",""]
[]
[null,"Driver","Lane","Slowest Lap Time","Fastest Lap Time","Average Lap Time","Total Laps"]
[null,"Shawn G.",1,5.1050000000000004,4.0250000000000004,4.2030000000000003,71.52]
[null,"Shawn G.",2,6.5380000000000003,4.0510000000000002,4.1879999999999997,72]
[null,"Shawn G.",3,5.5060000000000002,4.0209999999999999,4.1429999999999998,72]
[null,"Marty M.",1,6.1349999999999998,3.9849999999999999,4.2679999999999998,70]
[null,"Marty M.",2,5.3719999999999999,4.0010000000000003,4.1740000000000004,72]
[null,"Marty M.",3,5.8369999999999997,4.0119999999999996,4.21,71.510000000000005]
[null,"Russell M.",1,6.55,4.0960000000000001,4.375,68.72]
[null,"Russell M.",2,6.9039999999999999,4.0549999999999997,4.2480000000000002,71]
[null,"Russell M.",3,5.8380000000000001,4.0430000000000001,4.22,71]
[null,"Ary B.",1,4.8010000000000002,4.1779999999999999,4.298,69.400000000000006]
[null,"Ary B.",2,4.6189999999999998,4.1920000000000002,4.3769999999999998,69]
[null,"Ary B.",3,6.1829999999999998,4.1749999999999998,4.2910000000000004,70]
[null,"Roy M.",1,5.835,4.1479999999999997,4.3330000000000002,68.81]
[null,"Roy M.",2,5.5869999999999997,4.1479999999999997,4.3449999999999998,69]
[null,"Roy M.",3,5.3940000000000001,4.1760000000000002,4.383,69]
[null,"Brian H.",1,7.4829999999999997,4.1840000000000002,4.569,65.290000000000006]
[null,"Brian H.",2,9.9130000000000003,4.1500000000000004,4.4859999999999998,67]
[null,"Brian H.",3,6.5449999999999999,4.1829999999999998,4.5819999999999999,66]
[null,"Stephen B.",1,7.0140000000000002,4.202,4.6429999999999998,64]
[null,"Stephen B.",2,8.8290000000000006,4.3280000000000003,4.6920000000000002,64.239999999999995]
[null,"Stephen B.",3,6.6470000000000002,4.2530000000000001,4.59,66]
[null,"Austin C.",1,7.8159999999999998,4.2670000000000003,4.6349999999999998,64.81]
[null,"Austin C.",2,8.2289999999999992,4.2590000000000003,4.6820000000000004,64]
[null,"Austin C.",3,9.7119999999999997,4.2969999999999997,4.7729999999999997,63]
[null,"Rich C.",1,6.5039999999999996,4.6020000000000003,4.9009999999999998,61.4]
[null,"Rich C.",2,6.9,4.6449999999999996,4.9930000000000003,60]
[null,"Rich C.",3,7.3609999999999998,4.6260000000000003,4.9249999999999998,61]

{"sheet":"Round 6","index":6,"n_rows":41,"n_cols":7,"rows_kept":41,"cut":false,"hidden":false,"merged":[[1,1,1,6]]}
[]
[null,{"$f":"SeriesName & \" - Round 6\"","v":"2013 Scalextric GT - Round 6"}]
[null,"Position","Driver","Laps","Fastest Lap","Fastest Lap Bonus","Points"]
[null,1,"Shawn G.",216.55,3.9860000000000002,{"$f":"IF(C4<>\"\",IF(AND(E4=MIN($E$4:$E$15),E4>0),1,0),\"\")","v":0},{"$f":"IF(ISNA(VLOOKUP(B4,Points,2,FALSE)),\"\",VLOOKUP(B4,Points,2,FALSE)+F4)","v":10}]
[null,2,"Marty M.",215.75,3.9830000000000001,{"$f":"IF(C5<>\"\",IF(AND(E5=MIN($E$4:$E$15),E5>0),1,0),\"\")","v":1},10]
[null,3,"Brian H.",212.47,4.0049999999999999,0,8]
[null,4,"Russell M.",203.28,4.1399999999999997,0,7]
[null,5,"Roy M.",199.8,4.21,0,6]
[null,6,"Brett L.",179.3,4.4349999999999996,0,5]
[null,7,"Rich C.",178.8,4.4980000000000002,0,4]
[null,8,"Stephen B.",148,4,0,3]
[null,null,null,null,null,"",""]
[null,null,null,null,null,"",""]
[null,null,null,null,null,"",""]
[null,null,null,null,null,"",""]
[]
[null,"Driver","Lane","Slowest Lap Time","Fastest Lap Time","Average Lap Time","Total Laps"]
[null,"Shawn G.",1,5.51,3.9950000000000001,4.17,72]
[null,"Shawn G.",2,6.2430000000000003,3.9860000000000002,4.1420000000000003,72.55]
[null,"Shawn G.",3,7.3280000000000003,4.0190000000000001,4.1669999999999998,72]
[null,"Marty M.",1,5.9489999999999998,4.056,4.2510000000000003,70]
[null,"Marty M.",2,5.3209999999999997,3.9830000000000001,4.1589999999999998,73.75]
[null,"Marty M.",3,4.5960000000000001,4.0170000000000003,4.1239999999999997,72]
[null,"Brian H.",1,6.4939999999999998,4.0590000000000002,4.3090000000000002,70]
[null,"Brian H.",2,6.2370000000000001,4.0049999999999999,4.2240000000000002,71.47]
[null,"Brian H.",3,5.7290000000000001,4.0659999999999998,4.2050000000000001,71]
[null,"Russell M.",1,6.5309999999999997,4.1539999999999999,4.4189999999999996,67]
[null,"Russell M.",2,6.0839999999999996,4.1399999999999997,4.3979999999999997,68.28]
[null,"Russell M.",3,5.9790000000000001,4.1520000000000001,4.4489999999999998,68]
[null,"Roy M.",1,6.6609999999999996,4.2949999999999999,4.6340000000000003,64]
[null,"Roy M.",2,5.2110000000000003,4.26,4.4749999999999996,66.8]
[null,"Roy M.",3,5.657,4.21,4.3920000000000003,69]
[null,"Brett L.",1,7.9390000000000001,4.4349999999999996,4.8929999999999998,61]
[null,"Brett L.",2,8.8119999999999994,4.5090000000000003,5.069,59.3]
[null,"Brett L.",3,8.6760000000000002,4.6070000000000002,5.1059999999999999,59]
[null,"Rich C.",1,7.6619999999999999,4.5110000000000001,4.944,60]
[null,"Rich C.",2,6.9809999999999999,4.4980000000000002,4.9349999999999996,61.8]
[null,"Rich C.",3,7.9420000000000002,4.5789999999999997,5.258,57]
[null,"Stephen B.",1,6.3440000000000003,4,4.1749999999999998,72]
[null,"Stephen B.",2,5.9539999999999997,4.0430000000000001,4.26,70]
[null,"Stephen B.",3,5.9359999999999999,4.0419999999999998,4.4850000000000003,6]

{"sheet":"SumSheet","index":7,"n_rows":41,"n_cols":64,"rows_kept":41,"cut":false,"hidden":false,"merged":[[1,51,1,54],[1,55,1,60],[23,1,23,2],[1,1,2,1],[1,47,1,50],[1,2,1,6],[1,15,1,22],[1,7,1,14],[1,23,1,30],[1,31,1,38],[1,39,1,46]]}
[null,1,2,3,4,5,6,7,8,9,10,11,12,13,14,15,16,17,18,19,20,21,22,23,24,25,26,27,28,29,30,31,32,33,34,35,36,37,38,39,40,41,42,43,44,45,46,47,48,49,50,51,52,53,54,55,56,57,58,59,60]
[null,"Racer","Round 1",null,null,null,null,"Round 2",null,null,null,null,null,null,null,"Round 3",null,null,null,null,null,null,null,"Round 4",null,null,null,null,null,null,null,"Round 5",null,null,null,null,null,null,null,"Round 6",null,null,null,null,null,null,null,"Total",null,null,null,"Dropped Round",null,null,null,"Final Classification"]
[null,null,"Laps","Points","Fastest Lap","Total Round Points","Rank","Laps","Points","Fastest Lap","Total Round Points","Rank","Running Series Points","Running Series Rank","Change in Rank","Laps","Points","Fastest Lap","Total Round Points","Rank","Running Series Points","Running Series Rank","Change in Rank","Laps","Points","Fastest Lap","Total Round Points","Rank","Running Series Points","Running Series Rank","Change in Rank","Laps","Points","Fastest Lap","Total Round Points","Rank","Running Series Points","Running Series Rank","Change in Rank","Laps","Points","Fastest Lap","Total Round Points","Rank","Running Series Points","Running Series Rank","Change in Rank","Rounds Run","Points","Fastest Laps","Laps","Round","Points","Fastest Laps","Laps","Points","Fastest Laps","Total Points","Laps","Rank","Change in Rank"]
[null,"Ary B.",{"$f":"IF(ISNA(VLOOKUP($B4,Round1Results,2,FALSE)),0,VLOOKUP($B4,Round1Results,2,FALSE))","v":191.76},{"$f":"IF(ISNA(VLOOKUP($B4,Round1Results,5,FALSE)),0,VLOOKUP($B4,Round1Results,5,FALSE)-E4)","v":7},{"$f":"IF(ISNA(VLOOKUP($B4,Round1Results,4,FALSE)),0,VLOOKUP($B4,Round1Results,4,FALSE))","v":0},{"$f":"SUM(D4:E4)","v":7},{"$f":"IF(C4>0,RANK(F4,F$4:F$19),0)","v":4},{"$f":"IF(ISNA(VLOOKUP($B4,Round2Results,2,FALSE)),0,VLOOKUP($B4,Round2Results,2,FALSE))","v":213.2},{"$f":"IF(ISNA(VLOOKUP($B4,Round2Results,5,FALSE)),0,VLOOKUP($B4,Round2Results,5,FALSE)-J4)","v":9},{"$f":"IF(ISNA(VLOOKUP($B4,Round2Results,4,FALSE)),0,VLOOKUP($B4,Round2Results,4,FALSE))","v":1},{"$f":"SUM(I4:J4)","v":10},{"$f":"IF(H4>0,RANK(K4,K$4:K$19),\"-\")","v":1},{"$f":"F4+K4","v":17},{"$f":"RANK(M4,M$4:M$19)","v":2},{"$f":"IF(G4=0,0,G4-N4)","v":2},{"$f":"IF(ISNA(VLOOKUP($B4,Round3Results,2,FALSE)),0,VLOOKUP($B4,Round3Results,2,FALSE))","v":209.45},{"$f":"IF(ISNA(VLOOKUP($B4,Round3Results,5,FALSE)),0,VLOOKUP($B4,Round3Results,5,FALSE)-R4)","v":9},{"$f":"IF(ISNA(VLOOKUP($B4,Round3Results,4,FALSE)),0,VLOOKUP($B4,Round3Results,4,FALSE))","v":0},{"$f":"SUM(Q4:R4)","v":9},{"$f":"IF(P4>0,RANK(S4,S$4:S$19),\"-\")","v":2},{"$f":"M4+S4","v":26},{"$f":"RANK(U4,U$4:U$19)","v":2},{"$f":"IF(N4=0,0,N4-V4)","v":0},{"$f":"IF(ISNA(VLOOKUP($B4,Round4Results,2,FALSE)),0,VLOOKUP($B4,Round4Results,2,FALSE))","v":207.26},{"$f":"IF(ISNA(VLOOKUP($B4,Round4Results,5,FALSE)),0,VLOOKUP($B4,Round4Results,5,FALSE)-Z4)","v":7},{"$f":"IF(ISNA(VLOOKUP($B4,Round4Results,4,FALSE)),0,VLOOKUP($B4,Round4Results,4,FALSE))","v":0},{"$f":"SUM(Y4:Z4)","v":7},{"$f":"IF(X4>0,RANK(AA4,AA$4:AA$19),\"-\")","v":4},{"$f":"U4+AA4","v":33},{"$f":"RANK(AC4,AC$4:AC$19)","v":1},{"$f":"IF(V4=0,0,V4-AD4)","v":1},{"$f":"IF(ISNA(VLOOKUP($B4,Round5Results,2,FALSE)),0,VLOOKUP($B4,Round5Results,2,FALSE))","v":208.4},{"$f":"IF(ISNA(VLOOKUP($B4,Round5Results,5,FALSE)),0,VLOOKUP($B4,Round5Results,5,FALSE)-AH4)","v":7},{"$f":"IF(ISNA(VLOOKUP($B4,Round5Results,4,FALSE)),0,VLOOKUP($B4,Round5Results,4,FALSE))","v":0},{"$f":"SUM(AG4:AH4)","v":7},{"$f":"IF(AF4>0,RANK(AI4,AI$4:AI$19),\"-\")","v":4},{"$f":"AC4+AI4","v":40},{"$f":"RANK(AK4,AK$4:AK$19)","v":2},{"$f":"IF(AD4=0,0,AD4-AL4)","v":-1},{"$f":"IF(ISNA(VLOOKUP($B4,Round6Results,2,FALSE)),0,VLOOKUP($B4,Round6Results,2,FALSE))","v":0},{"$f":"IF(ISNA(VLOOKUP($B4,Round6Results,5,FALSE)),0,VLOOKUP($B4,Round6Results,5,FALSE)-AP4)","v":0},{"$f":"IF(ISNA(VLOOKUP($B4,Round6Results,4,FALSE)),0,VLOOKUP($B4,Round6Results,4,FALSE))","v":0},{"$f":"SUM(AO4:AP4)","v":0},{"$f":"IF(AN4>0,RANK(AQ4,AQ$4:AQ$19),\"-\")","v":"-"},{"$f":"AK4+AQ4","v":40},{"$f":"RANK(AS4,AS$4:AS$19)","v":2},{"$f":"IF(AL4=0,0,AL4-AT4)","v":0},{"$f":"COUNTIF(C4,\">0\")+COUNTIF(H4,\">0\")+COUNTIF(P4,\">0\")+COUNTIF(X4,\">0\")+COUNTIF(AF4,\">0\")+COUNTIF(AN4,\">0\")","v":5},{"$f":"D4+I4+Q4+Y4+AG4+AO4","v":39},1,{"$f":"C4+H4+P4+X4+AF4+AN4","v":1030.07},null,0,0,0,{"$f":"D4+I4+Q4+Y4+AG4+AO4-BA4","v":39},{"$f":"E4+J4+R4+Z4+AH4+AP4-BB4","v":1},{"$f":"BD4+BE4","v":40},{"$f":"C4+H4+P4+X4+AF4+AN4-BC4","v":1030.07},{"$f":"IF(AV4>0,RANK(BF4,$BF$4:$BF$19)+SUMPRODUCT(--($BF$4:$BF$19=BF4),--($BG$4:$BG$19>BG4)),0)","v":2},{"$f":"IF(B4<>\"\",IF(IF(RoundsRun=2,VLOOKUP(B4,SeriesSummary,14,FALSE),IF(RoundsRun=3,VLOOKUP(B4,SeriesSummary,22,FALSE),IF(RoundsRun=4,VLOOKUP(B4,SeriesSummary,30,FALSE),IF(RoundsRun=5,VLOOKUP(B4,SeriesSummary,38,FALSE),IF(RoundsRun=6,VLOOKUP(B4,SeriesSummary,46,FALSE),\"-\")))))>0,\"+\"&IF(RoundsRun=2,VLOOKUP(B4,SeriesSummary,14,FALSE),IF(RoundsRun=3,VLOOKUP(B4,SeriesSummary,22,FALSE),IF(RoundsRun=4,VLOOKUP(B4,SeriesSummary,30,FALSE),IF(RoundsRun=5,VLOOKUP(B4,SeriesSummary,38,FALSE),IF(RoundsRun=6,VLOOKUP(B4,SeriesSummary,46,FALSE),\"-\"))))),IF((IF(RoundsRun=2,VLOOKUP(B4,SeriesSummary,14,FALSE),IF(RoundsRun=3,VLOOKUP(B4,SeriesSummary,22,FALSE),IF(RoundsRun=4,VLOOKUP(B4,SeriesSummary,30,FALSE),IF(RoundsRun=5,VLOOKUP(B4,SeriesSummary,38,FALSE),IF(RoundsRun=6,VLOOKUP(B4,SeriesSummary,46,FALSE),\"-\"))))))=0,\"-\",(IF(RoundsRun=2,VLOOKUP(B4,SeriesSummary,14,FALSE),IF(RoundsRun=3,VLOOKUP(B4,SeriesSummary,22,FALSE),IF(RoundsRun=4,VLOOKUP(B4,SeriesSummary,30,FALSE),IF(RoundsRun=5,VLOOKUP(B4,SeriesSummary,38,FALSE),IF(RoundsRun=6,VLOOKUP(B4,SeriesSummary,46,FALSE),\"-\")))))))),\"\")","v":"-"},null,{"$f":"BH4","v":2},{"$f":"B4","v":"Ary B."}]
[null,"Austin C.",0,0,0,{"$f":"SUM(D5:E5)","v":0},{"$f":"IF(C5>0,RANK(F5,F$4:F$19),0)","v":0},0,0,0,{"$f":"SUM(I5:J5)","v":0},{"$f":"IF(H5>0,RANK(K5,K$4:K$19),\"-\")","v":"-"},{"$f":"F5+K5","v":0},{"$f":"RANK(M5,M$4:M$19)","v":9},{"$f":"IF(G5=0,0,G5-N5)","v":0},187.79,3,0,{"$f":"SUM(Q5:R5)","v":3},{"$f":"IF(P5>0,RANK(S5,S$4:S$19),\"-\")","v":8},{"$f":"M5+S5","v":3},{"$f":"RANK(U5,U$4:U$19)","v":10},{"$f":"IF(N5=0,0,N5-V5)","v":-1},202.41,6,0,{"$f":"SUM(Y5:Z5)","v":6},{"$f":"IF(X5>0,RANK(AA5,AA$4:AA$19),\"-\")","v":5},{"$f":"U5+AA5","v":9},{"$f":"RANK(AC5,AC$4:AC$19)","v":8},{"$f":"IF(V5=0,0,V5-AD5)","v":2},191.81,3,0,{"$f":"SUM(AG5:AH5)","v":3},{"$f":"IF(AF5>0,RANK(AI5,AI$4:AI$19),\"-\")","v":8},{"$f":"AC5+AI5","v":12},{"$f":"RANK(AK5,AK$4:AK$19)","v":9},{"$f":"IF(AD5=0,0,AD5-AL5)","v":-1},0,0,0,{"$f":"SUM(AO5:AP5)","v":0},{"$f":"IF(AN5>0,RANK(AQ5,AQ$4:AQ$19),\"-\")","v":"-"},{"$f":"AK5+AQ5","v":12},{"$f":"RANK(AS5,AS$4:AS$19)","v":9},{"$f":"IF(AL5=0,0,AL5-AT5)","v":0},3,12,0,582.01,null,0,0,0,{"$f":"D5+I5+Q5+Y5+AG5+AO5-BA5","v":12},0,{"$f":"BD5+BE5","v":12},582.01,{"$f":"IF(AV5>0,RANK(BF5,$BF$4:$BF$19)+SUMPRODUCT(--($BF$4:$BF$19=BF5),--($BG$4:$BG$19>BG5)),0)","v":9},"-",null,{"$f":"BH5","v":9},{"$f":"B5","v":"Austin C."}]
[null,"Bob L.",0,0,0,0,0,0,0,0,0,"-",{"$f":"F6+K6","v":0},9,{"$f":"IF(G6=0,0,G6-N6)","v":0},0,0,0,0,"-",{"$f":"M6+S6","v":0},11,{"$f":"IF(N6=0,0,N6-V6)","v":-2},0,0,0,0,"-",{"$f":"U6+AA6","v":0},11,{"$f":"IF(V6=0,0,V6-AD6)","v":0},0,0,0,0,"-",{"$f":"AC6+AI6","v":0},11,{"$f":"IF(AD6=0,0,AD6-AL6)","v":0},0,0,0,0,"-",{"$f":"AK6+AQ6","v":0},11,{"$f":"IF(AL6=0,0,AL6-AT6)","v":0},0,0,0,0,null,0,0,0,0,0,0,0,0,"-",null,0,"Bob L."]
[null,"Brandon M.",0,0,0,0,0,0,0,0,0,"-",{"$f":"F7+K7","v":0},9,{"$f":"IF(G7=0,0,G7-N7)","v":0},0,0,0,0,"-",{"$f":"M7+S7","v":0},11,{"$f":"IF(N7=0,0,N7-V7)","v":-2},0,0,0,0,"-",{"$f":"U7+AA7","v":0},11,{"$f":"IF(V7=0,0,V7-AD7)","v":0},0,0,0,0,"-",{"$f":"AC7+AI7","v":0},11,{"$f":"IF(AD7=0,0,AD7-AL7)","v":0},0,0,0,0,"-",{"$f":"AK7+AQ7","v":0},11,{"$f":"IF(AL7=0,0,AL7-AT7)","v":0},0,0,0,0,null,0,0,0,0,0,0,0,0,"-",null,0,"Brandon M."]
[null,"Brett L.",0,0,0,0,0,180.35,5,0,5,6,5,8,0,0,0,0,0,"-",5,9,-1,0,0,0,0,"-",5,10,-1,0,0,0,0,"-",5,10,0,179.3,5,0,5,6,10,10,0,2,10,0,359.65,null,0,0,0,10,0,10,359.65,10,"-",null,10,"Brett L."]
[null,"Brian H.",0,0,0,0,0,206.83,8,0,8,3,8,5,0,204.29,6,1,7,4,15,4,1,210.97,9,0,9,2,24,3,1,198.29,5,0,5,6,29,3,0,212.47,8,0,8,3,37,4,-1,5,36,1,1032.8499999999999,null,0,0,0,36,1,37,1032.8499999999999,4,-1,null,4,"Brian H."]
[null,"Jim J.",0,0,0,0,0,0,0,0,0,"-",0,9,0,0,0,0,0,"-",0,11,-2,0,0,0,0,"-",0,11,0,0,0,0,0,"-",0,11,0,0,0,0,0,"-",0,11,0,0,0,0,0,null,0,0,0,0,0,0,0,0,"-",null,0,"Jim J."]
[null,"Kevin F.",0,0,0,0,0,0,0,0,0,"-",0,9,0,0,0,0,0,"-",0,11,-2,0,0,0,0,"-",0,11,0,0,0,0,0,"-",0,11,0,0,0,0,0,"-",0,11,0,0,0,0,0,null,0,0,0,0,0,0,0,0,"-",null,0,"Kevin F."]
[null,"Marty M.",0,0,0,0,0,0,0,0,0,"-",0,9,0,206.78,8,0,8,3,8,8,1,216.46,10,1,11,1,19,6,2,213.51,9,1,10,1,29,3,3,215.75,9,1,10,1,39,3,0,4,36,3,852.5,null,{"$f":"MIN(D12,I12,Q12,Y12,AG12,AO12)","v":0},0,0,36,3,39,852.5,3,"-",null,3,"Marty M."]
[null,"Rich C.",189.9,6,0,{"$f":"SUM(D13:E13)","v":6},5,192.82,7,0,{"$f":"SUM(I13:J13)","v":7},4,13,3,2,200.6,5,0,{"$f":"SUM(Q13:R13)","v":5},6,18,3,0,196.48,4,0,{"$f":"SUM(Y13:Z13)","v":4},7,22,4,-1,182.4,2,0,{"$f":"SUM(AG13:AH13)","v":2},9,24,6,-2,178.8,4,0,{"$f":"SUM(AO13:AP13)","v":4},7,28,6,0,6,28,0,1141,null,0,0,0,28,0,28,1141,6,"-",null,6,"Rich C."]
[null,"Roy M.",204.41,9,0,9,2,0,0,0,0,"-",9,4,-2,0,0,0,0,"-",9,7,-3,0,0,0,0,"-",9,8,-1,206.81,6,0,6,5,15,8,0,199.8,6,0,6,5,21,8,0,3,21,0,611.02,null,{"$f":"MIN(D14,I14,Q14,Y14,AG14,AO14)","v":0},0,0,21,0,21,611.02,8,"-",null,8,"Roy M."]
[null,"Russell M.",0,0,0,0,0,191.5,6,0,6,5,6,7,0,205.31,7,0,7,4,13,5,2,209.86,8,0,8,3,21,5,0,210.72,8,0,8,3,29,3,2,203.28,7,0,7,4,36,5,-2,5,36,0,1020.6700000000001,null,0,0,0,36,0,36,1020.6700000000001,5,-2,null,5,"Russell M."]
[null,"Shawn G.",209.66,10,1,11,1,215.8,10,0,10,1,21,1,0,212.82,10,0,10,1,31,1,0,0,0,0,0,"-",31,2,-1,215.52,10,0,10,1,41,1,1,216.55,10,0,10,1,51,1,0,5,50,1,1070.3499999999999,null,0,0,0,50,1,51,1070.3499999999999,1,"-",null,1,"Shawn G."]
[null,"Stephen B.",199.74,8,0,8,3,0,0,0,0,"-",8,5,-2,200.05,4,0,4,7,12,6,-1,198.44,5,0,5,6,17,7,-1,194.24,4,0,4,7,21,7,0,148,3,0,3,8,24,7,0,5,24,0,940.47,null,0,0,0,24,0,24,940.47,7,"-",null,7,"Stephen B."]
[null,null,0,0,0,0,{"$f":"IF(C18>0,RANK(F18,F$4:F$19),0)","v":0},0,0,0,0,{"$f":"IF(H18>0,RANK(K18,K$4:K$19),\"-\")","v":"-"},0,{"$f":"RANK(M18,M$4:M$19)","v":9},0,0,0,0,0,{"$f":"IF(P18>0,RANK(S18,S$4:S$19),\"-\")","v":"-"},0,{"$f":"RANK(U18,U$4:U$19)","v":11},-2,0,0,0,0,{"$f":"IF(X18>0,RANK(AA18,AA$4:AA$19),\"-\")","v":"-"},0,{"$f":"RANK(AC18,AC$4:AC$19)","v":11},0,0,0,0,0,{"$f":"IF(AF18>0,RANK(AI18,AI$4:AI$19),\"-\")","v":"-"},0,{"$f":"RANK(AK18,AK$4:AK$19)","v":11},0,0,0,0,0,{"$f":"IF(AN18>0,RANK(AQ18,AQ$4:AQ$19),\"-\")","v":"-"},0,{"$f":"RANK(AS18,AS$4:AS$19)","v":11},0,0,0,0,0,null,0,0,0,0,0,0,0,0,"",null,0,0]
[null,null,0,0,0,0,{"$f":"IF(C19>0,RANK(F19,F$4:F$19),0)","v":0},0,0,0,0,{"$f":"IF(H19>0,RANK(K19,K$4:K$19),\"-\")","v":"-"},0,{"$f":"RANK(M19,M$4:M$19)","v":9},0,0,0,0,0,{"$f":"IF(P19>0,RANK(S19,S$4:S$19),\"-\")","v":"-"},0,{"$f":"RANK(U19,U$4:U$19)","v":11},-2,0,0,0,0,{"$f":"IF(X19>0,RANK(AA19,AA$4:AA$19),\"-\")","v":"-"},0,{"$f":"RANK(AC19,AC$4:AC$19)","v":11},0,0,0,0,0,{"$f":"IF(AF19>0,RANK(AI19,AI$4:AI$19),\"-\")","v":"-"},0,{"$f":"RANK(AK19,AK$4:AK$19)","v":11},0,0,0,0,0,{"$f":"IF(AN19>0,RANK(AQ19,AQ$4:AQ$19),\"-\")","v":"-"},0,{"$f":"RANK(AS19,AS$4:AS$19)","v":11},0,0,0,0,0,null,0,0,0,0,0,0,0,0,"",null,0,0]
[]
[]
[null,"Series Name","2013 Scalextric GT"]
[null,"Rounds Run",{"$f":"COUNT('Round 1'!B4,'Round 2'!B4,'Round 3'!B4,'Round 4'!B4,'Round 5'!B4,'Round 6'!B4)","v":6}]
[null,"Points Table"]
[null,"Position","Points"]
[null,1,10]
[null,2,9]
[null,3,8]
[null,4,7]
[null,5,6]
[null,6,5]
[null,7,4]
[null,8,3]
[null,9,2]
[null,10,1]
[null,11,1]
[null,12,1]
[null,13,1]
[null,14,1]
[null,15,1]
[null,16,1]