{"text_format":"1","workbook":"xlsx","n_sheets":8,"sheets":["Leader Board","Round 1","Round 2","Round 3","Round 4","Round 5","Round 6","SumSheet"],"not_rendered":{"charts":0,"images":0,"macros":1,"external_links":0,"defined_names":269,"comments":1,"pivot_tables":0},"unopened":[],"bounds":{"document_bytes":16777216,"sheet_cells":100000,"rows_first":2000,"rows_last":500,"rows_between":2000,"halvings":0,"cell_chars":16384,"cell_head_chars":4096},"cells_cut":0,"cells_raw":0,"read":"whole","date_system":"1900"}

{"sheet":"Leader Board","index":0,"n_rows":31,"n_cols":49,"rows_kept":31,"cut":false,"hidden":false,"merged":[[4,48,4,55],[4,1,4,9],[4,11,4,18],[4,20,4,27],[4,29,4,37],[4,39,4,46]]}
[]
[]
[]
[null,null,null,null,null,null,null,null,null,null,null,null,null,null,null,null,null,null,null,null,null,null,null,null,null,null,null,null,null,"Used to reformat the leader board after resorting the results. DO NOT MODIFY",null,null,null,null,null,null,null,null,null,"Used to reformat the Group A leader boards after resorting the results. DO NOT MODIFY",null,null,null,null,null,null,null,null,"Used to reformat the Group B leader board after resorting the results. DO NOT MODIFY"]
[null,{"$f":" SeriesName & \" - Round \" & RoundsRun & \" of 6  (Overall)\"","v":"2016 Group C / IMSA - Round 1 of 6  (Overall)"},null,null,null,null,null,null,null,null,null,{"$f":" SeriesName & \" - Round \" & RoundsRun & \" of 6 (Group A)\"","v":"2016 Group C / IMSA - Round 1 of 6 (Group A)"},null,null,null,null,null,null,null,null,{"$f":" SeriesName & \" - Round \" & RoundsRun & \" of 6 (Group B)\"","v":"2016 Group C / IMSA - Round 1 of 6 (Group B)"}]
[null,"Position","+/-","Driver","Grp","Points","Behind","Starts","Laps","Fastest Laps",null,"Position","+/-","Driver","Points","Behind","Starts","Laps","Fastest Laps",null,"Position","+/-","Driver","Points","Behind","Starts","Laps","Fastest Laps"]
[null,{"$f":"IF(ISNA(VLOOKUP($D7,SeriesSummary,Rank,FALSE)),\"\",VLOOKUP($D7,SeriesSummary,Rank,FALSE))","v":1},{"$f":"IF(ISNA(VLOOKUP($D7,SeriesSummary,ChangeInRank,FALSE)),\"\",VLOOKUP($D7,SeriesSummary,ChangeInRank,FALSE))","v":"-"},{"$f":"IF(SumSheet!BM16>0,SumSheet!B16,\"\")","v":"Shawn G."},{"$f":"IF(SumSheet!BM16>0,SumSheet!C16,\"\")","v":"A"},{"$f":"IF(D7<>\"\",IF(ISNA(VLOOKUP($D7,SeriesSummary,TotalPoints,FALSE)),\"-\",VLOOKUP($D7,SeriesSummary,TotalPoints,FALSE)),\"\")","v":20},"Leader",{"$f":"IF(ISNA(VLOOKUP($D7,SeriesSummary,Starts,FALSE)),\"\",VLOOKUP($D7,SeriesSummary,Starts,FALSE))","v":1},{"$f":"IF(ISNA(VLOOKUP($D7,SeriesSummary,TotalLaps,FALSE)),\"\",VLOOKUP($D7,SeriesSummary,TotalLaps,FALSE))","v":222.24},{"$f":"IF(ISNA(VLOOKUP($D7,SeriesSummary,FastestLaps,FALSE)),\"\",VLOOKUP($D7,SeriesSummary,FastestLaps,FALSE))","v":0},null,{"$f":"IF(ISNA(VLOOKUP($N7,SeriesSummary,ClassRank,FALSE)),\"\",VLOOKUP($N7,SeriesSummary,ClassRank,FALSE))","v":1},{"$f":"IF(ISNA(VLOOKUP($N7,SeriesSummary,ChangeInClassRank,FALSE)),\"\",VLOOKUP($N7,SeriesSummary,ChangeInClassRank,FALSE))","v":"-"},{"$f":"IF(AND(SumSheet!BM16>0,SumSheet!C16=\"A\"),SumSheet!B16,\"\")","v":"Shawn G."},{"$f":"IF(N7<>\"\",IF(ISNA(VLOOKUP($N7,SeriesSummary,TotalPoints,FALSE)),\"-\",VLOOKUP($N7,SeriesSummary,TotalPoints,FALSE)),\"\")","v":20},"Leader",{"$f":"IF(ISNA(VLOOKUP($N7,SeriesSummary,Starts,FALSE)),\"\",VLOOKUP($N7,SeriesSummary,Starts,FALSE))","v":1},{"$f":"IF(ISNA(VLOOKUP($N7,SeriesSummary,TotalLaps,FALSE)),\"\",VLOOKUP($N7,SeriesSummary,TotalLaps,FALSE))","v":222.24},{"$f":"IF(ISNA(VLOOKUP($N7,SeriesSummary,FastestLaps,FALSE)),\"\",VLOOKUP($N7,SeriesSummary,FastestLaps,FALSE))","v":0},null,{"$f":"IF(ISNA(VLOOKUP($W7,SeriesSummary,ClassRank,FALSE)),\"\",VLOOKUP($W7,SeriesSummary,ClassRank,FALSE))","v":1},{"$f":"IF(ISNA(VLOOKUP($W7,SeriesSummary,ChangeInClassRank,FALSE)),\"\",VLOOKUP($W7,SeriesSummary,ChangeInClassRank,FALSE))","v":"-"},{"$f":"IF(AND(SumSheet!BM29>0,SumSheet!C29=\"B\"),SumSheet!B29,\"\")","v":"Rich C."},{"$f":"IF(W7<>\"\",IF(ISNA(VLOOKUP($W7,SeriesSummary,TotalPoints,FALSE)),\"-\",VLOOKUP($W7,SeriesSummary,TotalPoints,FALSE)),\"\")","v":15},"Leader",{"$f":"IF(ISNA(VLOOKUP($W7,SeriesSummary,Starts,FALSE)),\"\",VLOOKUP($W7,SeriesSummary,Starts,FALSE))","v":1},{"$f":"IF(ISNA(VLOOKUP($W7,SeriesSummary,TotalLaps,FALSE)),\"\",VLOOKUP($W7,SeriesSummary,TotalLaps,FALSE))","v":205.32},{"$f":"IF(ISNA(VLOOKUP($W7,SeriesSummary,FastestLaps,FALSE)),\"\",VLOOKUP($W7,SeriesSummary,FastestLaps,FALSE))","v":0}]
[null,{"$f":"IF(ISNA(VLOOKUP($D8,SeriesSummary,Rank,FALSE)),\"\",VLOOKUP($D8,SeriesSummary,Rank,FALSE))","v":2},{"$f":"IF(ISNA(VLOOKUP($D8,SeriesSummary,ChangeInRank,FALSE)),\"\",VLOOKUP($D8,SeriesSummary,ChangeInRank,FALSE))","v":"-"},{"$f":"IF(SumSheet!BM13>0,SumSheet!B13,\"\")","v":"Marty M."},{"$f":"IF(SumSheet!BM13>0,SumSheet!C13,\"\")","v":"A"},20,{"$f":"IF(ISERROR(F8-$F$7),\"\",F8-$F$7)","v":0},1,219.8,1,null,{"$f":"IF(ISNA(VLOOKUP($N8,SeriesSummary,ClassRank,FALSE)),\"\",VLOOKUP($N8,SeriesSummary,ClassRank,FALSE))","v":2},{"$f":"IF(ISNA(VLOOKUP($N8,SeriesSummary,ChangeInClassRank,FALSE)),\"\",VLOOKUP($N8,SeriesSummary,ChangeInClassRank,FALSE))","v":"-"},{"$f":"IF(AND(SumSheet!BM13>0,SumSheet!C13=\"A\"),SumSheet!B13,\"\")","v":"Marty M."},20,{"$f":"IF(ISERROR(O8-$O$7),\"\",O8-$O$7)","v":0},1,219.8,1,null,{"$f":"IF(ISNA(VLOOKUP($W8,SeriesSummary,ClassRank,FALSE)),\"\",VLOOKUP($W8,SeriesSummary,ClassRank,FALSE))","v":2},{"$f":"IF(ISNA(VLOOKUP($W8,SeriesSummary,ChangeInClassRank,FALSE)),\"\",VLOOKUP($W8,SeriesSummary,ChangeInClassRank,FALSE))","v":"-"},{"$f":"IF(AND(SumSheet!BM24>0,SumSheet!C24=\"B\"),SumSheet!B24,\"\")","v":"Mark L."},14,{"$f":"IF(ISERROR(X8-$X$7),\"\",X8-$X$7)","v":-1},1,190.45,0]
[null,{"$f":"IF(ISNA(VLOOKUP($D9,SeriesSummary,Rank,FALSE)),\"\",VLOOKUP($D9,SeriesSummary,Rank,FALSE))","v":3},{"$f":"IF(ISNA(VLOOKUP($D9,SeriesSummary,ChangeInRank,FALSE)),\"\",VLOOKUP($D9,SeriesSummary,ChangeInRank,FALSE))","v":"-"},{"$f":"IF(SumSheet!BM17>0,SumSheet!B17,\"\")","v":"Stephen B."},{"$f":"IF(SumSheet!BM17>0,SumSheet!C17,\"\")","v":"A"},18,-2,1,214.8,0,null,{"$f":"IF(ISNA(VLOOKUP($N9,SeriesSummary,ClassRank,FALSE)),\"\",VLOOKUP($N9,SeriesSummary,ClassRank,FALSE))","v":3},{"$f":"IF(ISNA(VLOOKUP($N9,SeriesSummary,ChangeInClassRank,FALSE)),\"\",VLOOKUP($N9,SeriesSummary,ChangeInClassRank,FALSE))","v":"-"},{"$f":"IF(AND(SumSheet!BM17>0,SumSheet!C17=\"A\"),SumSheet!B17,\"\")","v":"Stephen B."},18,{"$f":"IF(ISERROR(O9-$O$7),\"\",O9-$O$7)","v":-2},1,214.8,0,null,{"$f":"IF(ISNA(VLOOKUP($W9,SeriesSummary,ClassRank,FALSE)),\"\",VLOOKUP($W9,SeriesSummary,ClassRank,FALSE))","v":3},{"$f":"IF(ISNA(VLOOKUP($W9,SeriesSummary,ChangeInClassRank,FALSE)),\"\",VLOOKUP($W9,SeriesSummary,ChangeInClassRank,FALSE))","v":"-"},{"$f":"IF(AND(SumSheet!BM21>0,SumSheet!C21=\"B\"),SumSheet!B21,\"\")","v":"Brett L."},14,-1,1,189,1]
[null,{"$f":"IF(ISNA(VLOOKUP($D10,SeriesSummary,Rank,FALSE)),\"\",VLOOKUP($D10,SeriesSummary,Rank,FALSE))","v":4},{"$f":"IF(ISNA(VLOOKUP($D10,SeriesSummary,ChangeInRank,FALSE)),\"\",VLOOKUP($D10,SeriesSummary,ChangeInRank,FALSE))","v":"-"},{"$f":"IF(SumSheet!BM15>0,SumSheet!B15,\"\")","v":"Russell M."},{"$f":"IF(SumSheet!BM15>0,SumSheet!C15,\"\")","v":"A"},17,-3,1,208.65,0,null,{"$f":"IF(ISNA(VLOOKUP($N10,SeriesSummary,ClassRank,FALSE)),\"\",VLOOKUP($N10,SeriesSummary,ClassRank,FALSE))","v":4},{"$f":"IF(ISNA(VLOOKUP($N10,SeriesSummary,ChangeInClassRank,FALSE)),\"\",VLOOKUP($N10,SeriesSummary,ChangeInClassRank,FALSE))","v":"-"},{"$f":"IF(AND(SumSheet!BM15>0,SumSheet!C15=\"A\"),SumSheet!B15,\"\")","v":"Russell M."},17,-3,1,208.65,0,null,{"$f":"IF(ISNA(VLOOKUP($W10,SeriesSummary,ClassRank,FALSE)),\"\",VLOOKUP($W10,SeriesSummary,ClassRank,FALSE))","v":4},{"$f":"IF(ISNA(VLOOKUP($W10,SeriesSummary,ChangeInClassRank,FALSE)),\"\",VLOOKUP($W10,SeriesSummary,ChangeInClassRank,FALSE))","v":"-"},{"$f":"IF(AND(SumSheet!BM18>0,SumSheet!C18=\"B\"),SumSheet!B18,\"\")","v":"Alejandro G."},12,-3,1,188.29,0]
[null,{"$f":"IF(ISNA(VLOOKUP($D11,SeriesSummary,Rank,FALSE)),\"\",VLOOKUP($D11,SeriesSummary,Rank,FALSE))","v":5},{"$f":"IF(ISNA(VLOOKUP($D11,SeriesSummary,ChangeInRank,FALSE)),\"\",VLOOKUP($D11,SeriesSummary,ChangeInRank,FALSE))","v":"-"},{"$f":"IF(SumSheet!BM11>0,SumSheet!B11,\"\")","v":"David C."},{"$f":"IF(SumSheet!BM11>0,SumSheet!C11,\"\")","v":"A"},16,-4,1,207,0,null,{"$f":"IF(ISNA(VLOOKUP($N11,SeriesSummary,ClassRank,FALSE)),\"\",VLOOKUP($N11,SeriesSummary,ClassRank,FALSE))","v":5},{"$f":"IF(ISNA(VLOOKUP($N11,SeriesSummary,ChangeInClassRank,FALSE)),\"\",VLOOKUP($N11,SeriesSummary,ChangeInClassRank,FALSE))","v":"-"},{"$f":"IF(AND(SumSheet!BM11>0,SumSheet!C11=\"A\"),SumSheet!B11,\"\")","v":"David C."},16,-4,1,207,0,null,{"$f":"IF(ISNA(VLOOKUP($W11,SeriesSummary,ClassRank,FALSE)),\"\",VLOOKUP($W11,SeriesSummary,ClassRank,FALSE))","v":5},{"$f":"IF(ISNA(VLOOKUP($W11,SeriesSummary,ChangeInClassRank,FALSE)),\"\",VLOOKUP($W11,SeriesSummary,ChangeInClassRank,FALSE))","v":"-"},{"$f":"IF(AND(SumSheet!BM26>0,SumSheet!C26=\"B\"),SumSheet!B26,\"\")","v":"Mitch A."},11,-4,1,185.24,0]
[null,{"$f":"IF(ISNA(VLOOKUP($D12,SeriesSummary,Rank,FALSE)),\"\",VLOOKUP($D12,SeriesSummary,Rank,FALSE))","v":6},{"$f":"IF(ISNA(VLOOKUP($D12,SeriesSummary,ChangeInRank,FALSE)),\"\",VLOOKUP($D12,SeriesSummary,ChangeInRank,FALSE))","v":"-"},{"$f":"IF(SumSheet!BM29>0,SumSheet!B29,\"\")","v":"Rich C."},{"$f":"IF(SumSheet!BM29>0,SumSheet!C29,\"\")","v":"B"},15,-5,1,205.32,0,null,{"$f":"IF(ISNA(VLOOKUP($N12,SeriesSummary,ClassRank,FALSE)),\"\",VLOOKUP($N12,SeriesSummary,ClassRank,FALSE))","v":""},{"$f":"IF(ISNA(VLOOKUP($N12,SeriesSummary,ChangeInClassRank,FALSE)),\"\",VLOOKUP($N12,SeriesSummary,ChangeInClassRank,FALSE))","v":""},{"$f":"IF(AND(SumSheet!BM12>0,SumSheet!C12=\"A\"),SumSheet!B12,\"\")","v":""},"","","","","",null,{"$f":"IF(ISNA(VLOOKUP($W12,SeriesSummary,ClassRank,FALSE)),\"\",VLOOKUP($W12,SeriesSummary,ClassRank,FALSE))","v":6},{"$f":"IF(ISNA(VLOOKUP($W12,SeriesSummary,ChangeInClassRank,FALSE)),\"\",VLOOKUP($W12,SeriesSummary,ChangeInClassRank,FALSE))","v":"-"},{"$f":"IF(AND(SumSheet!BM22>0,SumSheet!C22=\"B\"),SumSheet!B22,\"\")","v":"John B."},10,-5,1,171.8,0]
[null,{"$f":"IF(ISNA(VLOOKUP($D13,SeriesSummary,Rank,FALSE)),\"\",VLOOKUP($D13,SeriesSummary,Rank,FALSE))","v":7},{"$f":"IF(ISNA(VLOOKUP($D13,SeriesSummary,ChangeInRank,FALSE)),\"\",VLOOKUP($D13,SeriesSummary,ChangeInRank,FALSE))","v":"-"},{"$f":"IF(SumSheet!BM24>0,SumSheet!B24,\"\")","v":"Mark L."},{"$f":"IF(SumSheet!BM24>0,SumSheet!C24,\"\")","v":"B"},14,-6,1,190.45,0,null,{"$f":"IF(ISNA(VLOOKUP($N13,SeriesSummary,ClassRank,FALSE)),\"\",VLOOKUP($N13,SeriesSummary,ClassRank,FALSE))","v":""},{"$f":"IF(ISNA(VLOOKUP($N13,SeriesSummary,ChangeInClassRank,FALSE)),\"\",VLOOKUP($N13,SeriesSummary,ChangeInClassRank,FALSE))","v":""},{"$f":"IF(AND(SumSheet!BM14>0,SumSheet!C14=\"A\"),SumSheet!B14,\"\")","v":""},"","","","","",null,{"$f":"IF(ISNA(VLOOKUP($W13,SeriesSummary,ClassRank,FALSE)),\"\",VLOOKUP($W13,SeriesSummary,ClassRank,FALSE))","v":7},{"$f":"IF(ISNA(VLOOKUP($W13,SeriesSummary,ChangeInClassRank,FALSE)),\"\",VLOOKUP($W13,SeriesSummary,ChangeInClassRank,FALSE))","v":"-"},{"$f":"IF(AND(SumSheet!BM28>0,SumSheet!C28=\"B\"),SumSheet!B28,\"\")","v":"Randy A."},9,-6,1,159.80000000000001,0]
[null,{"$f":"IF(ISNA(VLOOKUP($D14,SeriesSummary,Rank,FALSE)),\"\",VLOOKUP($D14,SeriesSummary,Rank,FALSE))","v":8},{"$f":"IF(ISNA(VLOOKUP($D14,SeriesSummary,ChangeInRank,FALSE)),\"\",VLOOKUP($D14,SeriesSummary,ChangeInRank,FALSE))","v":"-"},{"$f":"IF(SumSheet!BM21>0,SumSheet!B21,\"\")","v":"Brett L."},{"$f":"IF(SumSheet!BM21>0,SumSheet!C21,\"\")","v":"B"},14,-6,1,189,1,null,{"$f":"IF(ISNA(VLOOKUP($N14,SeriesSummary,ClassRank,FALSE)),\"\",VLOOKUP($N14,SeriesSummary,ClassRank,FALSE))","v":""},{"$f":"IF(ISNA(VLOOKUP($N14,SeriesSummary,ChangeInClassRank,FALSE)),\"\",VLOOKUP($N14,SeriesSummary,ChangeInClassRank,FALSE))","v":""},{"$f":"IF(AND(SumSheet!BM29>0,SumSheet!C29=\"A\"),SumSheet!B29,\"\")","v":""},"","","","","",null,{"$f":"IF(ISNA(VLOOKUP($W14,SeriesSummary,ClassRank,FALSE)),\"\",VLOOKUP($W14,SeriesSummary,ClassRank,FALSE))","v":""},{"$f":"IF(ISNA(VLOOKUP($W14,SeriesSummary,ChangeInClassRank,FALSE)),\"\",VLOOKUP($W14,SeriesSummary,ChangeInClassRank,FALSE))","v":""},{"$f":"IF(AND(SumSheet!BM23>0,SumSheet!C23=\"B\"),SumSheet!B23,\"\")","v":""},"","","","",""]
[null,{"$f":"IF(ISNA(VLOOKUP($D15,SeriesSummary,Rank,FALSE)),\"\",VLOOKUP($D15,SeriesSummary,Rank,FALSE))","v":9},{"$f":"IF(ISNA(VLOOKUP($D15,SeriesSummary,ChangeInRank,FALSE)),\"\",VLOOKUP($D15,SeriesSummary,ChangeInRank,FALSE))","v":"-"},{"$f":"IF(SumSheet!BM18>0,SumSheet!B18,\"\")","v":"Alejandro G."},{"$f":"IF(SumSheet!BM18>0,SumSheet!C18,\"\")","v":"B"},12,-8,1,188.29,0,null,{"$f":"IF(ISNA(VLOOKUP($N15,SeriesSummary,ClassRank,FALSE)),\"\",VLOOKUP($N15,SeriesSummary,ClassRank,FALSE))","v":""},{"$f":"IF(ISNA(VLOOKUP($N15,SeriesSummary,ChangeInClassRank,FALSE)),\"\",VLOOKUP($N15,SeriesSummary,ChangeInClassRank,FALSE))","v":""},{"$f":"IF(AND(SumSheet!BM9>0,SumSheet!C9=\"A\"),SumSheet!B9,\"\")","v":""},"","","","","",null,{"$f":"IF(ISNA(VLOOKUP($W15,SeriesSummary,ClassRank,FALSE)),\"\",VLOOKUP($W15,SeriesSummary,ClassRank,FALSE))","v":""},{"$f":"IF(ISNA(VLOOKUP($W15,SeriesSummary,ChangeInClassRank,FALSE)),\"\",VLOOKUP($W15,SeriesSummary,ChangeInClassRank,FALSE))","v":""},{"$f":"IF(AND(SumSheet!BM20>0,SumSheet!C20=\"B\"),SumSheet!B20,\"\")","v":""},"","","","",""]
[null,{"$f":"IF(ISNA(VLOOKUP($D16,SeriesSummary,Rank,FALSE)),\"\",VLOOKUP($D16,SeriesSummary,Rank,FALSE))","v":10},{"$f":"IF(ISNA(VLOOKUP($D16,SeriesSummary,ChangeInRank,FALSE)),\"\",VLOOKUP($D16,SeriesSummary,ChangeInRank,FALSE))","v":"-"},{"$f":"IF(SumSheet!BM26>0,SumSheet!B26,\"\")","v":"Mitch A."},{"$f":"IF(SumSheet!BM26>0,SumSheet!C26,\"\")","v":"B"},11,-9,1,185.24,0,null,{"$f":"IF(ISNA(VLOOKUP($N16,SeriesSummary,ClassRank,FALSE)),\"\",VLOOKUP($N16,SeriesSummary,ClassRank,FALSE))","v":""},{"$f":"IF(ISNA(VLOOKUP($N16,SeriesSummary,ChangeInClassRank,FALSE)),\"\",VLOOKUP($N16,SeriesSummary,ChangeInClassRank,FALSE))","v":""},{"$f":"IF(AND(SumSheet!BM10>0,SumSheet!C10=\"A\"),SumSheet!B10,\"\")","v":""},"","","","","",null,{"$f":"IF(ISNA(VLOOKUP($W16,SeriesSummary,ClassRank,FALSE)),\"\",VLOOKUP($W16,SeriesSummary,ClassRank,FALSE))","v":""},{"$f":"IF(ISNA(VLOOKUP($W16,SeriesSummary,ChangeInClassRank,FALSE)),\"\",VLOOKUP($W16,SeriesSummary,ChangeInClassRank,FALSE))","v":""},{"$f":"IF(AND(SumSheet!BM17>0,SumSheet!C17=\"B\"),SumSheet!B17,\"\")","v":""},"","","","",""]
[null,{"$f":"IF(ISNA(VLOOKUP($D17,SeriesSummary,Rank,FALSE)),\"\",VLOOKUP($D17,SeriesSummary,Rank,FALSE))","v":11},{"$f":"IF(ISNA(VLOOKUP($D17,SeriesSummary,ChangeInRank,FALSE)),\"\",VLOOKUP($D17,SeriesSummary,ChangeInRank,FALSE))","v":"-"},{"$f":"IF(SumSheet!BM22>0,SumSheet!B22,\"\")","v":"John B."},{"$f":"IF(SumSheet!BM22>0,SumSheet!C22,\"\")","v":"B"},10,-10,1,171.8,0,null,{"$f":"IF(ISNA(VLOOKUP($N17,SeriesSummary,ClassRank,FALSE)),\"\",VLOOKUP($N17,SeriesSummary,ClassRank,FALSE))","v":""},{"$f":"IF(ISNA(VLOOKUP($N17,SeriesSummary,ChangeInClassRank,FALSE)),\"\",VLOOKUP($N17,SeriesSummary,ChangeInClassRank,FALSE))","v":""},{"$f":"IF(AND(SumSheet!BM18>0,SumSheet!C18=\"A\"),SumSheet!B18,\"\")","v":""},"","","","","",null,{"$f":"IF(ISNA(VLOOKUP($W17,SeriesSummary,ClassRank,FALSE)),\"\",VLOOKUP($W17,SeriesSummary,ClassRank,FALSE))","v":""},{"$f":"IF(ISNA(VLOOKUP($W17,SeriesSummary,ChangeInClassRank,FALSE)),\"\",VLOOKUP($W17,SeriesSummary,ChangeInClassRank,FALSE))","v":""},{"$f":"IF(AND(SumSheet!BM25>0,SumSheet!C25=\"B\"),SumSheet!B25,\"\")","v":""},"","","","",""]
[null,{"$f":"IF(ISNA(VLOOKUP($D18,SeriesSummary,Rank,FALSE)),\"\",VLOOKUP($D18,SeriesSummary,Rank,FALSE))","v":12},{"$f":"IF(ISNA(VLOOKUP($D18,SeriesSummary,ChangeInRank,FALSE)),\"\",VLOOKUP($D18,SeriesSummary,ChangeInRank,FALSE))","v":"-"},{"$f":"IF(SumSheet!BM28>0,SumSheet!B28,\"\")","v":"Randy A."},{"$f":"IF(SumSheet!BM28>0,SumSheet!C28,\"\")","v":"B"},9,-11,1,159.80000000000001,0,null,{"$f":"IF(ISNA(VLOOKUP($N18,SeriesSummary,ClassRank,FALSE)),\"\",VLOOKUP($N18,SeriesSummary,ClassRank,FALSE))","v":""},{"$f":"IF(ISNA(VLOOKUP($N18,SeriesSummary,ChangeInClassRank,FALSE)),\"\",VLOOKUP($N18,SeriesSummary,ChangeInClassRank,FALSE))","v":""},{"$f":"IF(AND(SumSheet!BM19>0,SumSheet!C19=\"A\"),SumSheet!B19,\"\")","v":""},"","","","","",null,{"$f":"IF(ISNA(VLOOKUP($W18,SeriesSummary,ClassRank,FALSE)),\"\",VLOOKUP($W18,SeriesSummary,ClassRank,FALSE))","v":""},{"$f":"IF(ISNA(VLOOKUP($W18,SeriesSummary,ChangeInClassRank,FALSE)),\"\",VLOOKUP($W18,SeriesSummary,ChangeInClassRank,FALSE))","v":""},{"$f":"IF(AND(SumSheet!BM27>0,SumSheet!C27=\"B\"),SumSheet!B27,\"\")","v":""},"","","","",""]
[null,{"$f":"IF(ISNA(VLOOKUP($D19,SeriesSummary,Rank,FALSE)),\"\",VLOOKUP($D19,SeriesSummary,Rank,FALSE))","v":""},{"$f":"IF(ISNA(VLOOKUP($D19,SeriesSummary,ChangeInRank,FALSE)),\"\",VLOOKUP($D19,SeriesSummary,ChangeInRank,FALSE))","v":""},{"$f":"IF(SumSheet!BM12>0,SumSheet!B12,\"\")","v":""},{"$f":"IF(SumSheet!BM12>0,SumSheet!C12,\"\")","v":""},"","","","","",null,{"$f":"IF(ISNA(VLOOKUP($N19,SeriesSummary,ClassRank,FALSE)),\"\",VLOOKUP($N19,SeriesSummary,ClassRank,FALSE))","v":""},{"$f":"IF(ISNA(VLOOKUP($N19,SeriesSummary,ChangeInClassRank,FALSE)),\"\",VLOOKUP($N19,SeriesSummary,ChangeInClassRank,FALSE))","v":""},{"$f":"IF(AND(SumSheet!BM20>0,SumSheet!C20=\"A\"),SumSheet!B20,\"\")","v":""},"","","","","",null,{"$f":"IF(ISNA(VLOOKUP($W19,SeriesSummary,ClassRank,FALSE)),\"\",VLOOKUP($W19,SeriesSummary,ClassRank,FALSE))","v":""},{"$f":"IF(ISNA(VLOOKUP($W19,SeriesSummary,ChangeInClassRank,FALSE)),\"\",VLOOKUP($W19,SeriesSummary,ChangeInClassRank,FALSE))","v":""},{"$f":"IF(AND(SumSheet!BM9>0,SumSheet!C9=\"B\"),SumSheet!B9,\"\")","v":""},"","","","",""]
[null,{"$f":"IF(ISNA(VLOOKUP($D20,SeriesSummary,Rank,FALSE)),\"\",VLOOKUP($D20,SeriesSummary,Rank,FALSE))","v":""},{"$f":"IF(ISNA(VLOOKUP($D20,SeriesSummary,ChangeInRank,FALSE)),\"\",VLOOKUP($D20,SeriesSummary,ChangeInRank,FALSE))","v":""},{"$f":"IF(SumSheet!BM14>0,SumSheet!B14,\"\")","v":""},{"$f":"IF(SumSheet!BM14>0,SumSheet!C14,\"\")","v":""},"","","","","",null,{"$f":"IF(ISNA(VLOOKUP($N20,SeriesSummary,ClassRank,FALSE)),\"\",VLOOKUP($N20,SeriesSummary,ClassRank,FALSE))","v":""},{"$f":"IF(ISNA(VLOOKUP($N20,SeriesSummary,ChangeInClassRank,FALSE)),\"\",VLOOKUP($N20,SeriesSummary,ChangeInClassRank,FALSE))","v":""},{"$f":"IF(AND(SumSheet!BM21>0,SumSheet!C21=\"A\"),SumSheet!B21,\"\")","v":""},"","","","","",null,{"$f":"IF(ISNA(VLOOKUP($W20,SeriesSummary,ClassRank,FALSE)),\"\",VLOOKUP($W20,SeriesSummary,ClassRank,FALSE))","v":""},{"$f":"IF(ISNA(VLOOKUP($W20,SeriesSummary,ChangeInClassRank,FALSE)),\"\",VLOOKUP($W20,SeriesSummary,ChangeInClassRank,FALSE))","v":""},{"$f":"IF(AND(SumSheet!BM10>0,SumSheet!C10=\"B\"),SumSheet!B10,\"\")","v":""},"","","","",""]
[null,{"$f":"IF(ISNA(VLOOKUP($D21,SeriesSummary,Rank,FALSE)),\"\",VLOOKUP($D21,SeriesSummary,Rank,FALSE))","v":""},{"$f":"IF(ISNA(VLOOKUP($D21,SeriesSummary,ChangeInRank,FALSE)),\"\",VLOOKUP($D21,SeriesSummary,ChangeInRank,FALSE))","v":""},{"$f":"IF(SumSheet!BM23>0,SumSheet!B23,\"\")","v":""},{"$f":"IF(SumSheet!BM23>0,SumSheet!C23,\"\")","v":""},"","","","","",null,{"$f":"IF(ISNA(VLOOKUP($N21,SeriesSummary,ClassRank,FALSE)),\"\",VLOOKUP($N21,SeriesSummary,ClassRank,FALSE))","v":""},{"$f":"IF(ISNA(VLOOKUP($N21,SeriesSummary,ChangeInClassRank,FALSE)),\"\",VLOOKUP($N21,SeriesSummary,ChangeInClassRank,FALSE))","v":""},{"$f":"IF(AND(SumSheet!BM22>0,SumSheet!C22=\"A\"),SumSheet!B22,\"\")","v":""},"","","","","",null,{"$f":"IF(ISNA(VLOOKUP($W21,SeriesSummary,ClassRank,FALSE)),\"\",VLOOKUP($W21,SeriesSummary,ClassRank,FALSE))","v":""},{"$f":"IF(ISNA(VLOOKUP($W21,SeriesSummary,ChangeInClassRank,FALSE)),\"\",VLOOKUP($W21,SeriesSummary,ChangeInClassRank,FALSE))","v":""},{"$f":"IF(AND(SumSheet!BM11>0,SumSheet!C11=\"B\"),SumSheet!B11,\"\")","v":""},"","","","",""]
[null,{"$f":"IF(ISNA(VLOOKUP($D22,SeriesSummary,Rank,FALSE)),\"\",VLOOKUP($D22,SeriesSummary,Rank,FALSE))","v":""},{"$f":"IF(ISNA(VLOOKUP($D22,SeriesSummary,ChangeInRank,FALSE)),\"\",VLOOKUP($D22,SeriesSummary,ChangeInRank,FALSE))","v":""},{"$f":"IF(SumSheet!BM20>0,SumSheet!B20,\"\")","v":""},{"$f":"IF(SumSheet!BM20>0,SumSheet!C20,\"\")","v":""},"","","","","",null,{"$f":"IF(ISNA(VLOOKUP($N22,SeriesSummary,ClassRank,FALSE)),\"\",VLOOKUP($N22,SeriesSummary,ClassRank,FALSE))","v":""},{"$f":"IF(ISNA(VLOOKUP($N22,SeriesSummary,ChangeInClassRank,FALSE)),\"\",VLOOKUP($N22,SeriesSummary,ChangeInClassRank,FALSE))","v":""},{"$f":"IF(AND(SumSheet!BM23>0,SumSheet!C23=\"A\"),SumSheet!B23,\"\")","v":""},"","","","","",null,{"$f":"IF(ISNA(VLOOKUP($W22,SeriesSummary,ClassRank,FALSE)),\"\",VLOOKUP($W22,SeriesSummary,ClassRank,FALSE))","v":""},{"$f":"IF(ISNA(VLOOKUP($W22,SeriesSummary,ChangeInClassRank,FALSE)),\"\",VLOOKUP($W22,SeriesSummary,ChangeInClassRank,FALSE))","v":""},{"$f":"IF(AND(SumSheet!BM12>0,SumSheet!C12=\"B\"),SumSheet!B12,\"\")","v":""},"","","","",""]
[null,{"$f":"IF(ISNA(VLOOKUP($D23,SeriesSummary,Rank,FALSE)),\"\",VLOOKUP($D23,SeriesSummary,Rank,FALSE))","v":""},{"$f":"IF(ISNA(VLOOKUP($D23,SeriesSummary,ChangeInRank,FALSE)),\"\",VLOOKUP($D23,SeriesSummary,ChangeInRank,FALSE))","v":""},{"$f":"IF(SumSheet!BM25>0,SumSheet!B25,\"\")","v":""},{"$f":"IF(SumSheet!BM25>0,SumSheet!C25,\"\")","v":""},"","","","","",null,{"$f":"IF(ISNA(VLOOKUP($N23,SeriesSummary,ClassRank,FALSE)),\"\",VLOOKUP($N23,SeriesSummary,ClassRank,FALSE))","v":""},{"$f":"IF(ISNA(VLOOKUP($N23,SeriesSummary,ChangeInClassRank,FALSE)),\"\",VLOOKUP($N23,SeriesSummary,ChangeInClassRank,FALSE))","v":""},{"$f":"IF(AND(SumSheet!BM24>0,SumSheet!C24=\"A\"),SumSheet!B24,\"\")","v":""},"","","","","",null,{"$f":"IF(ISNA(VLOOKUP($W23,SeriesSummary,ClassRank,FALSE)),\"\",VLOOKUP($W23,SeriesSummary,ClassRank,FALSE))","v":""},{"$f":"IF(ISNA(VLOOKUP($W23,SeriesSummary,ChangeInClassRank,FALSE)),\"\",VLOOKUP($W23,SeriesSummary,ChangeInClassRank,FALSE))","v":""},{"$f":"IF(AND(SumSheet!BM13>0,SumSheet!C13=\"B\"),SumSheet!B13,\"\")","v":""},"","","","",""]
[null,{"$f":"IF(ISNA(VLOOKUP($D24,SeriesSummary,Rank,FALSE)),\"\",VLOOKUP($D24,SeriesSummary,Rank,FALSE))","v":""},{"$f":"IF(ISNA(VLOOKUP($D24,SeriesSummary,ChangeInRank,FALSE)),\"\",VLOOKUP($D24,SeriesSummary,ChangeInRank,FALSE))","v":""},{"$f":"IF(SumSheet!BM27>0,SumSheet!B27,\"\")","v":""},{"$f":"IF(SumSheet!BM27>0,SumSheet!C27,\"\")","v":""},"","","","","",null,{"$f":"IF(ISNA(VLOOKUP($N24,SeriesSummary,ClassRank,FALSE)),\"\",VLOOKUP($N24,SeriesSummary,ClassRank,FALSE))","v":""},{"$f":"IF(ISNA(VLOOKUP($N24,SeriesSummary,ChangeInClassRank,FALSE)),\"\",VLOOKUP($N24,SeriesSummary,ChangeInClassRank,FALSE))","v":""},{"$f":"IF(AND(SumSheet!BM25>0,SumSheet!C25=\"A\"),SumSheet!B25,\"\")","v":""},"","","","","",null,{"$f":"IF(ISNA(VLOOKUP($W24,SeriesSummary,ClassRank,FALSE)),\"\",VLOOKUP($W24,SeriesSummary,ClassRank,FALSE))","v":""},{"$f":"IF(ISNA(VLOOKUP($W24,SeriesSummary,ChangeInClassRank,FALSE)),\"\",VLOOKUP($W24,SeriesSummary,ChangeInClassRank,FALSE))","v":""},{"$f":"IF(AND(SumSheet!BM14>0,SumSheet!C14=\"B\"),SumSheet!B14,\"\")","v":""},"","","","",""]
[null,{"$f":"IF(ISNA(VLOOKUP($D25,SeriesSummary,Rank,FALSE)),\"\",VLOOKUP($D25,SeriesSummary,Rank,FALSE))","v":""},{"$f":"IF(ISNA(VLOOKUP($D25,SeriesSummary,ChangeInRank,FALSE)),\"\",VLOOKUP($D25,SeriesSummary,ChangeInRank,FALSE))","v":""},{"$f":"IF(SumSheet!BM9>0,SumSheet!B9,\"\")","v":""},{"$f":"IF(SumSheet!BM9>0,SumSheet!C9,\"\")","v":""},"","","","","",null,{"$f":"IF(ISNA(VLOOKUP($N25,SeriesSummary,ClassRank,FALSE)),\"\",VLOOKUP($N25,SeriesSummary,ClassRank,FALSE))","v":""},{"$f":"IF(ISNA(VLOOKUP($N25,SeriesSummary,ChangeInClassRank,FALSE)),\"\",VLOOKUP($N25,SeriesSummary,ChangeInClassRank,FALSE))","v":""},{"$f":"IF(AND(SumSheet!BM26>0,SumSheet!C26=\"A\"),SumSheet!B26,\"\")","v":""},"","","","","",null,{"$f":"IF(ISNA(VLOOKUP($W25,SeriesSummary,ClassRank,FALSE)),\"\",VLOOKUP($W25,SeriesSummary,ClassRank,FALSE))","v":""},{"$f":"IF(ISNA(VLOOKUP($W25,SeriesSummary,ChangeInClassRank,FALSE)),\"\",VLOOKUP($W25,SeriesSummary,ChangeInClassRank,FALSE))","v":""},{"$f":"IF(AND(SumSheet!BM15>0,SumSheet!C15=\"B\"),SumSheet!B15,\"\")","v":""},"","","","",""]
[null,{"$f":"IF(ISNA(VLOOKUP($D26,SeriesSummary,Rank,FALSE)),\"\",VLOOKUP($D26,SeriesSummary,Rank,FALSE))","v":""},{"$f":"IF(ISNA(VLOOKUP($D26,SeriesSummary,ChangeInRank,FALSE)),\"\",VLOOKUP($D26,SeriesSummary,ChangeInRank,FALSE))","v":""},{"$f":"IF(SumSheet!BM10>0,SumSheet!B10,\"\")","v":""},{"$f":"IF(SumSheet!BM10>0,SumSheet!C10,\"\")","v":""},"","","","","",null,{"$f":"IF(ISNA(VLOOKUP($N26,SeriesSummary,ClassRank,FALSE)),\"\",VLOOKUP($N26,SeriesSummary,ClassRank,FALSE))","v":""},{"$f":"IF(ISNA(VLOOKUP($N26,SeriesSummary,ChangeInClassRank,FALSE)),\"\",VLOOKUP($N26,SeriesSummary,ChangeInClassRank,FALSE))","v":""},{"$f":"IF(AND(SumSheet!BM27>0,SumSheet!C27=\"A\"),SumSheet!B27,\"\")","v":""},"","","","","",null,{"$f":"IF(ISNA(VLOOKUP($W26,SeriesSummary,ClassRank,FALSE)),\"\",VLOOKUP($W26,SeriesSummary,ClassRank,FALSE))","v":""},{"$f":"IF(ISNA(VLOOKUP($W26,SeriesSummary,ChangeInClassRank,FALSE)),\"\",VLOOKUP($W26,SeriesSummary,ChangeInClassRank,FALSE))","v":""},{"$f":"IF(AND(SumSheet!BM16>0,SumSheet!C16=\"B\"),SumSheet!B16,\"\")","v":""},"","","","",""]
[null,{"$f":"IF(ISNA(VLOOKUP($D27,SeriesSummary,Rank,FALSE)),\"\",VLOOKUP($D27,SeriesSummary,Rank,FALSE))","v":""},{"$f":"IF(ISNA(VLOOKUP($D27,SeriesSummary,ChangeInRank,FALSE)),\"\",VLOOKUP($D27,SeriesSummary,ChangeInRank,FALSE))","v":""},{"$f":"IF(SumSheet!BM19>0,SumSheet!B19,\"\")","v":""},{"$f":"IF(SumSheet!BM19>0,SumSheet!C19,\"\")","v":""},"","","","","",null,{"$f":"IF(ISNA(VLOOKUP($N27,SeriesSummary,ClassRank,FALSE)),\"\",VLOOKUP($N27,SeriesSummary,ClassRank,FALSE))","v":""},{"$f":"IF(ISNA(VLOOKUP($N27,SeriesSummary,ChangeInClassRank,FALSE)),\"\",VLOOKUP($N27,SeriesSummary,ChangeInClassRank,FALSE))","v":""},{"$f":"IF(AND(SumSheet!BM28>0,SumSheet!C28=\"A\"),SumSheet!B28,\"\")","v":""},"","","","","",null,{"$f":"IF(ISNA(VLOOKUP($W27,SeriesSummary,ClassRank,FALSE)),\"\",VLOOKUP($W27,SeriesSummary,ClassRank,FALSE))","v":""},{"$f":"IF(ISNA(VLOOKUP($W27,SeriesSummary,ChangeInClassRank,FALSE)),\"\",VLOOKUP($W27,SeriesSummary,ChangeInClassRank,FALSE))","v":""},{"$f":"IF(AND(SumSheet!BM19>0,SumSheet!C19=\"B\"),SumSheet!B19,\"\")","v":""},"","","","",""]
[null,{"$f":"IF(ISNA(VLOOKUP($D28,SeriesSummary,Rank,FALSE)),\"\",VLOOKUP($D28,SeriesSummary,Rank,FALSE))","v":""},{"$f":"IF(ISNA(VLOOKUP($D28,SeriesSummary,ChangeInRank,FALSE)),\"\",VLOOKUP($D28,SeriesSummary,ChangeInRank,FALSE))","v":""},{"$f":"IF(SumSheet!BM30>0,SumSheet!B30,\"\")","v":""},{"$f":"IF(SumSheet!BM30>0,SumSheet!C30,\"\")","v":""},"","","","","",null,{"$f":"IF(ISNA(VLOOKUP($N28,SeriesSummary,ClassRank,FALSE)),\"\",VLOOKUP($N28,SeriesSummary,ClassRank,FALSE))","v":""},{"$f":"IF(ISNA(VLOOKUP($N28,SeriesSummary,ChangeInClassRank,FALSE)),\"\",VLOOKUP($N28,SeriesSummary,ChangeInClassRank,FALSE))","v":""},{"$f":"IF(AND(SumSheet!BM30>0,SumSheet!C30=\"A\"),SumSheet!B30,\"\")","v":""},"","","","","",null,{"$f":"IF(ISNA(VLOOKUP($W28,SeriesSummary,ClassRank,FALSE)),\"\",VLOOKUP($W28,SeriesSummary,ClassRank,FALSE))","v":""},{"$f":"IF(ISNA(VLOOKUP($W28,SeriesSummary,ChangeInClassRank,FALSE)),\"\",VLOOKUP($W28,SeriesSummary,ChangeInClassRank,FALSE))","v":""},{"$f":"IF(AND(SumSheet!BM30>0,SumSheet!C30=\"B\"),SumSheet!B30,\"\")","v":""},"","","","",""]
[null,{"$f":"IF(ISNA(VLOOKUP($D29,SeriesSummary,Rank,FALSE)),\"\",VLOOKUP($D29,SeriesSummary,Rank,FALSE))","v":""},{"$f":"IF(ISNA(VLOOKUP($D29,SeriesSummary,ChangeInRank,FALSE)),\"\",VLOOKUP($D29,SeriesSummary,ChangeInRank,FALSE))","v":""},{"$f":"IF(SumSheet!BM31>0,SumSheet!B31,\"\")","v":""},{"$f":"IF(SumSheet!BM31>0,SumSheet!C31,\"\")","v":""},"","","","","",null,{"$f":"IF(ISNA(VLOOKUP($N29,SeriesSummary,ClassRank,FALSE)),\"\",VLOOKUP($N29,SeriesSummary,ClassRank,FALSE))","v":""},{"$f":"IF(ISNA(VLOOKUP($N29,SeriesSummary,ChangeInClassRank,FALSE)),\"\",VLOOKUP($N29,SeriesSummary,ChangeInClassRank,FALSE))","v":""},{"$f":"IF(AND(SumSheet!BM31>0,SumSheet!C31=\"A\"),SumSheet!B31,\"\")","v":""},"","","","","",null,{"$f":"IF(ISNA(VLOOKUP($W29,SeriesSummary,ClassRank,FALSE)),\"\",VLOOKUP($W29,SeriesSummary,ClassRank,FALSE))","v":""},{"$f":"IF(ISNA(VLOOKUP($W29,SeriesSummary,ChangeInClassRank,FALSE)),\"\",VLOOKUP($W29,SeriesSummary,ChangeInClassRank,FALSE))","v":""},{"$f":"IF(AND(SumSheet!BM31>0,SumSheet!C31=\"B\"),SumSheet!B31,\"\")","v":""},"","","","",""]
[null,{"$f":"IF(ISNA(VLOOKUP($D30,SeriesSummary,Rank,FALSE)),\"\",VLOOKUP($D30,SeriesSummary,Rank,FALSE))","v":""},{"$f":"IF(ISNA(VLOOKUP($D30,SeriesSummary,ChangeInRank,FALSE)),\"\",VLOOKUP($D30,SeriesSummary,ChangeInRank,FALSE))","v":""},{"$f":"IF(SumSheet!BM32>0,SumSheet!B32,\"\")","v":""},{"$f":"IF(SumSheet!BM32>0,SumSheet!C32,\"\")","v":""},"","","","","",null,{"$f":"IF(ISNA(VLOOKUP($N30,SeriesSummary,ClassRank,FALSE)),\"\",VLOOKUP($N30,SeriesSummary,ClassRank,FALSE))","v":""},{"$f":"IF(ISNA(VLOOKUP($N30,SeriesSummary,ChangeInClassRank,FALSE)),\"\",VLOOKUP($N30,SeriesSummary,ChangeInClassRank,FALSE))","v":""},{"$f":"IF(AND(SumSheet!BM32>0,SumSheet!C32=\"A\"),SumSheet!B32,\"\")","v":""},"","","","","",null,{"$f":"IF(ISNA(VLOOKUP($W30,SeriesSummary,ClassRank,FALSE)),\"\",VLOOKUP($W30,SeriesSummary,ClassRank,FALSE))","v":""},{"$f":"IF(ISNA(VLOOKUP($W30,SeriesSummary,ChangeInClassRank,FALSE)),\"\",VLOOKUP($W30,SeriesSummary,ChangeInClassRank,FALSE))","v":""},{"$f":"IF(AND(SumSheet!BM32>0,SumSheet!C32=\"B\"),SumSheet!B32,\"\")","v":""},"","","","",""]
[null,{"$f":"IF(ISNA(VLOOKUP($D31,SeriesSummary,Rank,FALSE)),\"\",VLOOKUP($D31,SeriesSummary,Rank,FALSE))","v":""},{"$f":"IF(ISNA(VLOOKUP($D31,SeriesSummary,ChangeInRank,FALSE)),\"\",VLOOKUP($D31,SeriesSummary,ChangeInRank,FALSE))","v":""},{"$f":"IF(SumSheet!BM33>0,SumSheet!B33,\"\")","v":""},{"$f":"IF(SumSheet!BM33>0,SumSheet!C33,\"\")","v":""},"","","","","",null,{"$f":"IF(ISNA(VLOOKUP($N31,SeriesSummary,ClassRank,FALSE)),\"\",VLOOKUP($N31,SeriesSummary,ClassRank,FALSE))","v":""},{"$f":"IF(ISNA(VLOOKUP($N31,SeriesSummary,ChangeInClassRank,FALSE)),\"\",VLOOKUP($N31,SeriesSummary,ChangeInClassRank,FALSE))","v":""},{"$f":"IF(AND(SumSheet!BM33>0,SumSheet!C33=\"A\"),SumSheet!B33,\"\")","v":""},"","","","","",null,{"$f":"IF(ISNA(VLOOKUP($W31,SeriesSummary,ClassRank,FALSE)),\"\",VLOOKUP($W31,SeriesSummary,ClassRank,FALSE))","v":""},{"$f":"IF(ISNA(VLOOKUP($W31,SeriesSummary,ChangeInClassRank,FALSE)),\"\",VLOOKUP($W31,SeriesSummary,ChangeInClassRank,FALSE))","v":""},{"$f":"IF(AND(SumSheet!BM33>0,SumSheet!C33=\"B\"),SumSheet!B33,\"\")","v":""},"","","","",""]

{"sheet":"Round 1","index":1,"n_rows":61,"n_cols":8,"rows_kept":61,"cut":false,"hidden":false,"merged":[[1,1,1,7]]}
[]
[null,{"$f":"SeriesName & \" - Round 1\"","v":"2016 Group C / IMSA - Round 1"}]
[null,"Position","Driver","Laps","Fastest Lap","Group","Fastest Lap Bonus","Points"]
[null,1,"Shawn G.",222.24,3.9289999999999998,{"$f":"IF(ISNA(VLOOKUP(C4,SeriesSummary,Group,FALSE)),\"\",VLOOKUP(C4,SeriesSummary,Group,FALSE))","v":"A"},{"$f":"IF(C4<>\"\",IF(AND(E4=MIN( IF( $F$4:$F$23=F4, $E$4:$E$23)),E4>0),1,0),\"\")","v":0},{"$f":"IF(ISNA(VLOOKUP(B4,Points,2,FALSE)),\"\",VLOOKUP(B4,Points,2,FALSE)+G4)","v":20}]
[null,2,"Marty M.",219.8,3.91,"A",{"$f":"IF(C5<>\"\",IF(AND(E5=MIN( IF( $F$4:$F$23=F5, $E$4:$E$23)),E5>0),1,0),\"\")","v":1},20]
[null,3,"Stephen B.",214.8,3.9129999999999998,"A",{"$f":"IF(C6<>\"\",IF(AND(E6=MIN( IF( $F$4:$F$23=F6, $E$4:$E$23)),E6>0),1,0),\"\")","v":0},18]
[null,4,"Russell M.",208.65,3.9910000000000001,"A",{"$f":"IF(C7<>\"\",IF(AND(E7=MIN( IF( $F$4:$F$23=F7, $E$4:$E$23)),E7>0),1,0),\"\")","v":0},17]
[null,5,"David C.",207,3.9550000000000001,"A",{"$f":"IF(C8<>\"\",IF(AND(E8=MIN( IF( $F$4:$F$23=F8, $E$4:$E$23)),E8>0),1,0),\"\")","v":0},16]
[null,6,"Rich C.",205.32,4.1319999999999997,"B",{"$f":"IF(C9<>\"\",IF(AND(E9=MIN( IF( $F$4:$F$23=F9, $E$4:$E$23)),E9>0),1,0),\"\")","v":0},15]
[null,7,"Mark L.",190.45,4.1310000000000002,"B",{"$f":"IF(C10<>\"\",IF(AND(E10=MIN( IF( $F$4:$F$23=F10, $E$4:$E$23)),E10>0),1,0),\"\")","v":0},14]
[null,8,"Brett L.",189,4.1219999999999999,"B",{"$f":"IF(C11<>\"\",IF(AND(E11=MIN( IF( $F$4:$F$23=F11, $E$4:$E$23)),E11>0),1,0),\"\")","v":1},14]
[null,9,"Alejandro G.",188.29,4.2460000000000004,"B",{"$f":"IF(C12<>\"\",IF(AND(E12=MIN( IF( $F$4:$F$23=F12, $E$4:$E$23)),E12>0),1,0),\"\")","v":0},12]
[null,10,"Mitch A.",185.24,4.4080000000000004,"B",{"$f":"IF(C13<>\"\",IF(AND(E13=MIN( IF( $F$4:$F$23=F13, $E$4:$E$23)),E13>0),1,0),\"\")","v":0},11]
[null,11,"John B.",171.8,4.4050000000000002,"B",{"$f":"IF(C14<>\"\",IF(AND(E14=MIN( IF( $F$4:$F$23=F14, $E$4:$E$23)),E14>0),1,0),\"\")","v":0},10]
[null,12,"Randy A.",159.80000000000001,4.6829999999999998,"B",{"$f":"IF(C15<>\"\",IF(AND(E15=MIN( IF( $F$4:$F$23=F15, $E$4:$E$23)),E15>0),1,0),\"\")","v":0},9]
[null,null,null,null,null,"",{"$f":"IF(C16<>\"\",IF(AND(E16=MIN( IF( $F$4:$F$23=F16, $E$4:$E$23)),E16>0),1,0),\"\")","v":""},""]
[null,null,null,null,null,"",{"$f":"IF(C17<>\"\",IF(AND(E17=MIN( IF( $F$4:$F$23=F17, $E$4:$E$23)),E17>0),1,0),\"\")","v":""},""]
[null,null,null,null,null,"",{"$f":"IF(C18<>\"\",IF(AND(E18=MIN( IF( $F$4:$F$23=F18, $E$4:$E$23)),E18>0),1,0),\"\")","v":""},""]
[null,null,null,null,null,"",{"$f":"IF(C19<>\"\",IF(AND(E19=MIN( IF( $F$4:$F$23=F19, $E$4:$E$23)),E19>0),1,0),\"\")","v":""},""]
[null,null,null,null,null,"",{"$f":"IF(C20<>\"\",IF(AND(E20=MIN( IF( $F$4:$F$23=F20, $E$4:$E$23)),E20>0),1,0),\"\")","v":""},""]
[null,null,null,null,null,"",{"$f":"IF(C21<>\"\",IF(AND(E21=MIN( IF( $F$4:$F$23=F21, $E$4:$E$23)),E21>0),1,0),\"\")","v":""},""]
[null,null,null,null,null,"",{"$f":"IF(C22<>\"\",IF(AND(E22=MIN( IF( $F$4:$F$23=F22, $E$4:$E$23)),E22>0),1,0),\"\")","v":""},""]
[null,null,null,null,null,"",{"$f":"IF(C23<>\"\",IF(AND(E23=MIN( IF( $F$4:$F$23=F23, $E$4:$E$23)),E23>0),1,0),\"\")","v":""},""]
[]
[null,"Driver","Lane","Slowest Lap Time","Fastest Lap Time","Average Lap Time","Total Laps"]
[null,"Shawn G.",1,4.6639999999999997,3.9289999999999998,4.04,74.239999999999995]
[null,"Shawn G.",2,7.8470000000000004,3.9350000000000001,4.0890000000000004,75]
[null,"Shawn G.",3,5.157,3.9649999999999999,4.0789999999999997,73]
[null,"Marty M.",1,4.9889999999999999,3.9380000000000002,4.0579999999999998,73.8]
[null,"Marty M.",2,5.9379999999999997,3.91,4.13,72]
[null,"Marty M.",3,5.6870000000000003,3.9689999999999999,4.0940000000000003,74]
[null,"Stephen B.",1,7.7960000000000003,3.9129999999999998,4.274,71.8]
[null,"Stephen B.",2,5.8330000000000002,3.9420000000000002,4.17,72]
[null,"Stephen B.",3,5.8280000000000003,3.9510000000000001,4.1760000000000002,71]
[null,"Russell M.",1,8.6280000000000001,4.0430000000000001,4.3540000000000001,68.650000000000006]
[null,"Russell M.",2,6.2960000000000003,3.9910000000000001,4.3280000000000003,70]
[null,"Russell M.",3,6.5960000000000001,4.0179999999999998,4.2619999999999996,70]
[null,"David C.",1,8.4749999999999996,3.9550000000000001,4.532,66]
[null,"David C.",2,6.133,4.0570000000000004,4.2329999999999997,71]
[null,"David C.",3,6.76,4.0389999999999997,4.2610000000000001,70]
[null,"Rich C.",1,8.4629999999999992,4.2880000000000003,4.5350000000000001,67.319999999999993]
[null,"Rich C.",2,5.8849999999999998,4.1319999999999997,4.327,70]
[null,"Rich C.",3,7.1989999999999998,4.1669999999999998,4.351,68]
[null,"Mark L.",1,7.2569999999999997,4.149,4.5970000000000004,65.45]
[null,"Mark L.",2,10.31,4.1310000000000002,4.9130000000000003,61]
[null,"Mark L.",3,6.798,4.1929999999999996,4.68,64]
[null,"Brett L.",1,12.227,4.3540000000000001,4.9210000000000003,61]
[null,"Brett L.",2,7.4720000000000004,4.1219999999999999,4.6859999999999999,64]
[null,"Brett L.",3,6.984,4.2759999999999998,4.7320000000000002,64]
[null,"Alejandro G.",1,9.4329999999999998,4.2460000000000004,4.6539999999999999,64.290000000000006]
[null,"Alejandro G.",2,6.8440000000000003,4.2809999999999997,4.5949999999999998,66]
[null,"Alejandro G.",3,7.23,4.4390000000000001,5.1390000000000002,58]
[null,"Mitch A.",1,5.5419999999999998,4.4649999999999999,4.71,63.24]
[null,"Mitch A.",2,7.4710000000000001,4.4080000000000004,5.1980000000000004,59]
[null,"Mitch A.",3,5.0309999999999997,4.46,4.6909999999999998,63]
[null,"John B.",1,7.2809999999999997,4.4580000000000002,5.0389999999999997,59.8]
[null,"John B.",2,9.6609999999999996,4.4050000000000002,5.2690000000000001,57]
[null,"John B.",3,9.5649999999999995,4.7359999999999998,5.423,55]
[null,"Randy A.",1,7.9880000000000004,4.6829999999999998,5.5469999999999997,54.8]
[null,"Randy A.",2,9.0280000000000005,4.82,5.6360000000000001,53]
[null,"Randy A.",3,9.3670000000000009,4.8689999999999998,5.718,52]

{"sheet":"Round 2","index":2,"n_rows":25,"n_cols":8,"rows_kept":25,"cut":false,"hidden":false,"merged":[[1,1,1,7]]}
[]
[null,{"$f":"SeriesName & \" - Round 2\"","v":"2016 Group C / IMSA - Round 2"}]
[null,"Position","Driver","Laps","Fastest Lap","Group","Fastest Lap Bonus","Points"]
[null,null,null,null,null,{"$f":"IF(ISNA(VLOOKUP(C4,SeriesSummary,Group,FALSE)),\"\",VLOOKUP(C4,SeriesSummary,Group,FALSE))","v":""},{"$f":"IF(C4<>\"\",IF(AND(E4=MIN( IF( $F$4:$F$23=F4, $E$4:$E$23)),E4>0),1,0),\"\")","v":""},{"$f":"IF(ISNA(VLOOKUP(B4,Points,2,FALSE)),\"\",VLOOKUP(B4,Points,2,FALSE)+G4)","v":""}]
[null,null,null,null,null,"",{"$f":"IF(C5<>\"\",IF(AND(E5=MIN( IF( $F$4:$F$23=F5, $E$4:$E$23)),E5>0),1,0),\"\")","v":""},""]
[null,null,null,null,null,"",{"$f":"IF(C6<>\"\",IF(AND(E6=MIN( IF( $F$4:$F$23=F6, $E$4:$E$23)),E6>0),1,0),\"\")","v":""},""]
[null,null,null,null,null,"",{"$f":"IF(C7<>\"\",IF(AND(E7=MIN( IF( $F$4:$F$23=F7, $E$4:$E$23)),E7>0),1,0),\"\")","v":""},""]
[null,null,null,null,null,"",{"$f":"IF(C8<>\"\",IF(AND(E8=MIN( IF( $F$4:$F$23=F8, $E$4:$E$23)),E8>0),1,0),\"\")","v":""},""]
[null,null,null,null,null,"",{"$f":"IF(C9<>\"\",IF(AND(E9=MIN( IF( $F$4:$F$23=F9, $E$4:$E$23)),E9>0),1,0),\"\")","v":""},""]
[null,null,null,null,null,"",{"$f":"IF(C10<>\"\",IF(AND(E10=MIN( IF( $F$4:$F$23=F10, $E$4:$E$23)),E10>0),1,0),\"\")","v":""},""]
[null,null,null,null,null,"",{"$f":"IF(C11<>\"\",IF(AND(E11=MIN( IF( $F$4:$F$23=F11, $E$4:$E$23)),E11>0),1,0),\"\")","v":""},""]
[null,null,null,null,null,"",{"$f":"IF(C12<>\"\",IF(AND(E12=MIN( IF( $F$4:$F$23=F12, $E$4:$E$23)),E12>0),1,0),\"\")","v":""},""]
[null,null,null,null,null,"",{"$f":"IF(C13<>\"\",IF(AND(E13=MIN( IF( $F$4:$F$23=F13, $E$4:$E$23)),E13>0),1,0),\"\")","v":""},""]
[null,null,null,null,null,"",{"$f":"IF(C14<>\"\",IF(AND(E14=MIN( IF( $F$4:$F$23=F14, $E$4:$E$23)),E14>0),1,0),\"\")","v":""},""]
[null,null,null,null,null,"",{"$f":"IF(C15<>\"\",IF(AND(E15=MIN( IF( $F$4:$F$23=F15, $E$4:$E$23)),E15>0),1,0),\"\")","v":""},""]
[null,null,null,null,null,"",{"$f":"IF(C16<>\"\",IF(AND(E16=MIN( IF( $F$4:$F$23=F16, $E$4:$E$23)),E16>0),1,0),\"\")","v":""},""]
[null,null,null,null,null,"",{"$f":"IF(C17<>\"\",IF(AND(E17=MIN( IF( $F$4:$F$23=F17, $E$4:$E$23)),E17>0),1,0),\"\")","v":""},""]
[null,null,null,null,null,"",{"$f":"IF(C18<>\"\",IF(AND(E18=MIN( IF( $F$4:$F$23=F18, $E$4:$E$23)),E18>0),1,0),\"\")","v":""},""]
[null,null,null,null,null,"",{"$f":"IF(C19<>\"\",IF(AND(E19=MIN( IF( $F$4:$F$23=F19, $E$4:$E$23)),E19>0),1,0),\"\")","v":""},""]
[null,null,null,null,null,"",{"$f":"IF(C20<>\"\",IF(AND(E20=MIN( IF( $F$4:$F$23=F20, $E$4:$E$23)),E20>0),1,0),\"\")","v":""},""]
[null,null,null,null,null,"",{"$f":"IF(C21<>\"\",IF(AND(E21=MIN( IF( $F$4:$F$23=F21, $E$4:$E$23)),E21>0),1,0),\"\")","v":""},""]
[null,null,null,null,null,"",{"$f":"IF(C22<>\"\",IF(AND(E22=MIN( IF( $F$4:$F$23=F22, $E$4:$E$23)),E22>0),1,0),\"\")","v":""},""]
[null,null,null,null,null,"",{"$f":"IF(C23<>\"\",IF(AND(E23=MIN( IF( $F$4:$F$23=F23, $E$4:$E$23)),E23>0),1,0),\"\")","v":""},""]
[]
[null,"Driver","Lane","Slowest Lap Time","Fastest Lap Time","Average Lap Time","Total Laps"]

{"sheet":"Round 3","index":3,"n_rows":25,"n_cols":8,"rows_kept":25,"cut":false,"hidden":false,"merged":[[1,1,1,7]]}
[]
[null,{"$f":"SeriesName & \" - Round 3\"","v":"2016 Group C / IMSA - Round 3"}]
[null,"Position","Driver","Laps","Fastest Lap","Group","Fastest Lap Bonus","Points"]
[null,null,null,null,null,{"$f":"IF(ISNA(VLOOKUP(C4,SeriesSummary,Group,FALSE)),\"\",VLOOKUP(C4,SeriesSummary,Group,FALSE))","v":""},{"$f":"IF(C4<>\"\",IF(AND(E4=MIN( IF( $F$4:$F$23=F4, $E$4:$E$23)),E4>0),1,0),\"\")","v":""},{"$f":"IF(ISNA(VLOOKUP(B4,Points,2,FALSE)),\"\",VLOOKUP(B4,Points,2,FALSE)+G4)","v":""}]
[null,null,null,null,null,"",{"$f":"IF(C5<>\"\",IF(AND(E5=MIN( IF( $F$4:$F$23=F5, $E$4:$E$23)),E5>0),1,0),\"\")","v":""},""]
[null,null,null,null,null,"",{"$f":"IF(C6<>\"\",IF(AND(E6=MIN( IF( $F$4:$F$23=F6, $E$4:$E$23)),E6>0),1,0),\"\")","v":""},""]
[null,null,null,null,null,"",{"$f":"IF(C7<>\"\",IF(AND(E7=MIN( IF( $F$4:$F$23=F7, $E$4:$E$23)),E7>0),1,0),\"\")","v":""},""]
[null,null,null,null,null,"",{"$f":"IF(C8<>\"\",IF(AND(E8=MIN( IF( $F$4:$F$23=F8, $E$4:$E$23)),E8>0),1,0),\"\")","v":""},""]
[null,null,null,null,null,"",{"$f":"IF(C9<>\"\",IF(AND(E9=MIN( IF( $F$4:$F$23=F9, $E$4:$E$23)),E9>0),1,0),\"\")","v":""},""]
[null,null,null,null,null,"",{"$f":"IF(C10<>\"\",IF(AND(E10=MIN( IF( $F$4:$F$23=F10, $E$4:$E$23)),E10>0),1,0),\"\")","v":""},""]
[null,null,null,null,null,"",{"$f":"IF(C11<>\"\",IF(AND(E11=MIN( IF( $F$4:$F$23=F11, $E$4:$E$23)),E11>0),1,0),\"\")","v":""},""]
[null,null,null,null,null,"",{"$f":"IF(C12<>\"\",IF(AND(E12=MIN( IF( $F$4:$F$23=F12, $E$4:$E$23)),E12>0),1,0),\"\")","v":""},""]
[null,null,null,null,null,"",{"$f":"IF(C13<>\"\",IF(AND(E13=MIN( IF( $F$4:$F$23=F13, $E$4:$E$23)),E13>0),1,0),\"\")","v":""},""]
[null,null,null,null,null,"",{"$f":"IF(C14<>\"\",IF(AND(E14=MIN( IF( $F$4:$F$23=F14, $E$4:$E$23)),E14>0),1,0),\"\")","v":""},""]
[null,null,null,null,null,"",{"$f":"IF(C15<>\"\",IF(AND(E15=MIN( IF( $F$4:$F$23=F15, $E$4:$E$23)),E15>0),1,0),\"\")","v":""},""]
[null,null,null,null,null,"",{"$f":"IF(C16<>\"\",IF(AND(E16=MIN( IF( $F$4:$F$23=F16, $E$4:$E$23)),E16>0),1,0),\"\")","v":""},""]
[null,null,null,null,null,"",{"$f":"IF(C17<>\"\",IF(AND(E17=MIN( IF( $F$4:$F$23=F17, $E$4:$E$23)),E17>0),1,0),\"\")","v":""},""]
[null,null,null,null,null,"",{"$f":"IF(C18<>\"\",IF(AND(E18=MIN( IF( $F$4:$F$23=F18, $E$4:$E$23)),E18>0),1,0),\"\")","v":""},""]
[null,null,null,null,null,"",{"$f":"IF(C19<>\"\",IF(AND(E19=MIN( IF( $F$4:$F$23=F19, $E$4:$E$23)),E19>0),1,0),\"\")","v":""},""]
[null,null,null,null,null,"",{"$f":"IF(C20<>\"\",IF(AND(E20=MIN( IF( $F$4:$F$23=F20, $E$4:$E$23)),E20>0),1,0),\"\")","v":""},""]
[null,null,null,null,null,"",{"$f":"IF(C21<>\"\",IF(AND(E21=MIN( IF( $F$4:$F$23=F21, $E$4:$E$23)),E21>0),1,0),\"\")","v":""},""]
[null,null,null,null,null,"",{"$f":"IF(C22<>\"\",IF(AND(E22=MIN( IF( $F$4:$F$23=F22, $E$4:$E$23)),E22>0),1,0),\"\")","v":""},""]
[null,null,null,null,null,"",{"$f":"IF(C23<>\"\",IF(AND(E23=MIN( IF( $F$4:$F$23=F23, $E$4:$E$23)),E23>0),1,0),\"\")","v":""},""]
[]
[null,"Driver","Lane","Slowest Lap Time","Fastest Lap Time","Average Lap Time","Total Laps"]

{"sheet":"Round 4","index":4,"n_rows":25,"n_cols":8,"rows_kept":25,"cut":false,"hidden":false,"merged":[[1,1,1,7]]}
[]
[null,{"$f":"SeriesName & \" - Round 4\"","v":"2016 Group C / IMSA - Round 4"}]
[null,"Position","Driver","Laps","Fastest Lap","Group","Fastest Lap Bonus","Points"]
[null,null,null,null,null,{"$f":"IF(ISNA(VLOOKUP(C4,SeriesSummary,Group,FALSE)),\"\",VLOOKUP(C4,SeriesSummary,Group,FALSE))","v":""},{"$f":"IF(C4<>\"\",IF(AND(E4=MIN( IF( $F$4:$F$23=F4, $E$4:$E$23)),E4>0),1,0),\"\")","v":""},{"$f":"IF(ISNA(VLOOKUP(B4,Points,2,FALSE)),\"\",VLOOKUP(B4,Points,2,FALSE)+G4)","v":""}]
[null,null,null,null,null,"",{"$f":"IF(C5<>\"\",IF(AND(E5=MIN( IF( $F$4:$F$23=F5, $E$4:$E$23)),E5>0),1,0),\"\")","v":""},""]
[null,null,null,null,null,"",{"$f":"IF(C6<>\"\",IF(AND(E6=MIN( IF( $F$4:$F$23=F6, $E$4:$E$23)),E6>0),1,0),\"\")","v":""},""]
[null,null,null,null,null,"",{"$f":"IF(C7<>\"\",IF(AND(E7=MIN( IF( $F$4:$F$23=F7, $E$4:$E$23)),E7>0),1,0),\"\")","v":""},""]
[null,null,null,null,null,"",{"$f":"IF(C8<>\"\",IF(AND(E8=MIN( IF( $F$4:$F$23=F8, $E$4:$E$23)),E8>0),1,0),\"\")","v":""},""]
[null,null,null,null,null,"",{"$f":"IF(C9<>\"\",IF(AND(E9=MIN( IF( $F$4:$F$23=F9, $E$4:$E$23)),E9>0),1,0),\"\")","v":""},""]
[null,null,null,null,null,"",{"$f":"IF(C10<>\"\",IF(AND(E10=MIN( IF( $F$4:$F$23=F10, $E$4:$E$23)),E10>0),1,0),\"\")","v":""},""]
[null,null,null,null,null,"",{"$f":"IF(C11<>\"\",IF(AND(E11=MIN( IF( $F$4:$F$23=F11, $E$4:$E$23)),E11>0),1,0),\"\")","v":""},""]
[null,null,null,null,null,"",{"$f":"IF(C12<>\"\",IF(AND(E12=MIN( IF( $F$4:$F$23=F12, $E$4:$E$23)),E12>0),1,0),\"\")","v":""},""]
[null,null,null,null,null,"",{"$f":"IF(C13<>\"\",IF(AND(E13=MIN( IF( $F$4:$F$23=F13, $E$4:$E$23)),E13>0),1,0),\"\")","v":""},""]
[null,null,null,null,null,"",{"$f":"IF(C14<>\"\",IF(AND(E14=MIN( IF( $F$4:$F$23=F14, $E$4:$E$23)),E14>0),1,0),\"\")","v":""},""]
[null,null,null,null,null,"",{"$f":"IF(C15<>\"\",IF(AND(E15=MIN( IF( $F$4:$F$23=F15, $E$4:$E$23)),E15>0),1,0),\"\")","v":""},""]
[null,null,null,null,null,"",{"$f":"IF(C16<>\"\",IF(AND(E16=MIN( IF( $F$4:$F$23=F16, $E$4:$E$23)),E16>0),1,0),\"\")","v":""},""]
[null,null,null,null,null,"",{"$f":"IF(C17<>\"\",IF(AND(E17=MIN( IF( $F$4:$F$23=F17, $E$4:$E$23)),E17>0),1,0),\"\")","v":""},""]
[null,null,null,null,null,"",{"$f":"IF(C18<>\"\",IF(AND(E18=MIN( IF( $F$4:$F$23=F18, $E$4:$E$23)),E18>0),1,0),\"\")","v":""},""]
[null,null,null,null,null,"",{"$f":"IF(C19<>\"\",IF(AND(E19=MIN( IF( $F$4:$F$23=F19, $E$4:$E$23)),E19>0),1,0),\"\")","v":""},""]
[null,null,null,null,null,"",{"$f":"IF(C20<>\"\",IF(AND(E20=MIN( IF( $F$4:$F$23=F20, $E$4:$E$23)),E20>0),1,0),\"\")","v":""},""]
[null,null,null,null,null,"",{"$f":"IF(C21<>\"\",IF(AND(E21=MIN( IF( $F$4:$F$23=F21, $E$4:$E$23)),E21>0),1,0),\"\")","v":""},""]
[null,null,null,null,null,"",{"$f":"IF(C22<>\"\",IF(AND(E22=MIN( IF( $F$4:$F$23=F22, $E$4:$E$23)),E22>0),1,0),\"\")","v":""},""]
[null,null,null,null,null,"",{"$f":"IF(C23<>\"\",IF(AND(E23=MIN( IF( $F$4:$F$23=F23, $E$4:$E$23)),E23>0),1,0),\"\")","v":""},""]
[]
[null,"Driver","Lane","Slowest Lap Time","Fastest Lap Time","Average Lap Time","Total Laps"]

{"sheet":"Round 5","index":5,"n_rows":25,"n_cols":8,"rows_kept":25,"cut":false,"hidden":false,"merged":[[1,1,1,7]]}
[]
[null,{"$f":"SeriesName & \" - Round 5\"","v":"2016 Group C / IMSA - Round 5"}]
[null,"Position","Driver","Laps","Fastest Lap","Group","Fastest Lap Bonus","Points"]
[null,null,null,null,null,{"$f":"IF(ISNA(VLOOKUP(C4,SeriesSummary,Group,FALSE)),\"\",VLOOKUP(C4,SeriesSummary,Group,FALSE))","v":""},{"$f":"IF(C4<>\"\",IF(AND(E4=MIN( IF( $F$4:$F$23=F4, $E$4:$E$23)),E4>0),1,0),\"\")","v":""},{"$f":"IF(ISNA(VLOOKUP(B4,Points,2,FALSE)),\"\",VLOOKUP(B4,Points,2,FALSE)+G4)","v":""}]
[null,null,null,null,null,"",{"$f":"IF(C5<>\"\",IF(AND(E5=MIN( IF( $F$4:$F$23=F5, $E$4:$E$23)),E5>0),1,0),\"\")","v":""},""]
[null,null,null,null,null,"",{"$f":"IF(C6<>\"\",IF(AND(E6=MIN( IF( $F$4:$F$23=F6, $E$4:$E$23)),E6>0),1,0),\"\")","v":""},""]
[null,null,null,null,null,"",{"$f":"IF(C7<>\"\",IF(AND(E7=MIN( IF( $F$4:$F$23=F7, $E$4:$E$23)),E7>0),1,0),\"\")","v":""},""]
[null,null,null,null,null,"",{"$f":"IF(C8<>\"\",IF(AND(E8=MIN( IF( $F$4:$F$23=F8, $E$4:$E$23)),E8>0),1,0),\"\")","v":""},""]
[null,null,null,null,null,"",{"$f":"IF(C9<>\"\",IF(AND(E9=MIN( IF( $F$4:$F$23=F9, $E$4:$E$23)),E9>0),1,0),\"\")","v":""},""]
[null,null,null,null,null,"",{"$f":"IF(C10<>\"\",IF(AND(E10=MIN( IF( $F$4:$F$23=F10, $E$4:$E$23)),E10>0),1,0),\"\")","v":""},""]
[null,null,null,null,null,"",{"$f":"IF(C11<>\"\",IF(AND(E11=MIN( IF( $F$4:$F$23=F11, $E$4:$E$23)),E11>0),1,0),\"\")","v":""},""]
[null,null,null,null,null,"",{"$f":"IF(C12<>\"\",IF(AND(E12=MIN( IF( $F$4:$F$23=F12, $E$4:$E$23)),E12>0),1,0),\"\")","v":""},""]
[null,null,null,null,null,"",{"$f":"IF(C13<>\"\",IF(AND(E13=MIN( IF( $F$4:$F$23=F13, $E$4:$E$23)),E13>0),1,0),\"\")","v":""},""]
[null,null,null,null,null,"",{"$f":"IF(C14<>\"\",IF(AND(E14=MIN( IF( $F$4:$F$23=F14, $E$4:$E$23)),E14>0),1,0),\"\")","v":""},""]
[null,null,null,null,null,"",{"$f":"IF(C15<>\"\",IF(AND(E15=MIN( IF( $F$4:$F$23=F15, $E$4:$E$23)),E15>0),1,0),\"\")","v":""},""]
[null,null,null,null,null,"",{"$f":"IF(C16<>\"\",IF(AND(E16=MIN( IF( $F$4:$F$23=F16, $E$4:$E$23)),E16>0),1,0),\"\")","v":""},""]
[null,null,null,null,null,"",{"$f":"IF(C17<>\"\",IF(AND(E17=MIN( IF( $F$4:$F$23=F17, $E$4:$E$23)),E17>0),1,0),\"\")","v":""},""]
[null,null,null,null,null,"",{"$f":"IF(C18<>\"\",IF(AND(E18=MIN( IF( $F$4:$F$23=F18, $E$4:$E$23)),E18>0),1,0),\"\")","v":""},""]
[null,null,null,null,null,"",{"$f":"IF(C19<>\"\",IF(AND(E19=MIN( IF( $F$4:$F$23=F19, $E$4:$E$23)),E19>0),1,0),\"\")","v":""},""]
[null,null,null,null,null,"",{"$f":"IF(C20<>\"\",IF(AND(E20=MIN( IF( $F$4:$F$23=F20, $E$4:$E$23)),E20>0),1,0),\"\")","v":""},""]
[null,null,null,null,null,"",{"$f":"IF(C21<>\"\",IF(AND(E21=MIN( IF( $F$4:$F$23=F21, $E$4:$E$23)),E21>0),1,0),\"\")","v":""},""]
[null,null,null,null,null,"",{"$f":"IF(C22<>\"\",IF(AND(E22=MIN( IF( $F$4:$F$23=F22, $E$4:$E$23)),E22>0),1,0),\"\")","v":""},""]
[null,null,null,null,null,"",{"$f":"IF(C23<>\"\",IF(AND(E23=MIN( IF( $F$4:$F$23=F23, $E$4:$E$23)),E23>0),1,0),\"\")","v":""},""]
[]
[null,"Driver","Lane","Slowest Lap Time","Fastest Lap Time","Average Lap Time","Total Laps"]

{"sheet":"Round 6","index":6,"n_rows":25,"n_cols":8,"rows_kept":25,"cut":false,"hidden":false,"merged":[[1,1,1,7]]}
[]
[null,{"$f":"SeriesName & \" - Round 6\"","v":"2016 Group C / IMSA - Round 6"}]
[null,"Position","Driver","Laps","Fastest Lap","Group","Fastest Lap Bonus","Points"]
[null,null,null,null,null,{"$f":"IF(ISNA(VLOOKUP(C4,SeriesSummary,Group,FALSE)),\"\",VLOOKUP(C4,SeriesSummary,Group,FALSE))","v":""},{"$f":"IF(C4<>\"\",IF(AND(E4=MIN( IF( $F$4:$F$23=F4, $E$4:$E$23)),E4>0),1,0),\"\")","v":""},{"$f":"IF(ISNA(VLOOKUP(B4,Points,2,FALSE)),\"\",VLOOKUP(B4,Points,2,FALSE)+G4)","v":""}]
[null,null,null,null,null,"",{"$f":"IF(C5<>\"\",IF(AND(E5=MIN( IF( $F$4:$F$23=F5, $E$4:$E$23)),E5>0),1,0),\"\")","v":""},""]
[null,null,null,null,null,"",{"$f":"IF(C6<>\"\",IF(AND(E6=MIN( IF( $F$4:$F$23=F6, $E$4:$E$23)),E6>0),1,0),\"\")","v":""},""]
[null,null,null,null,null,"",{"$f":"IF(C7<>\"\",IF(AND(E7=MIN( IF( $F$4:$F$23=F7, $E$4:$E$23)),E7>0),1,0),\"\")","v":""},""]
[null,null,null,null,null,"",{"$f":"IF(C8<>\"\",IF(AND(E8=MIN( IF( $F$4:$F$23=F8, $E$4:$E$23)),E8>0),1,0),\"\")","v":""},""]
[null,null,null,null,null,"",{"$f":"IF(C9<>\"\",IF(AND(E9=MIN( IF( $F$4:$F$23=F9, $E$4:$E$23)),E9>0),1,0),\"\")","v":""},""]
[null,null,null,null,null,"",{"$f":"IF(C10<>\"\",IF(AND(E10=MIN( IF( $F$4:$F$23=F10, $E$4:$E$23)),E10>0),1,0),\"\")","v":""},""]
[null,null,null,null,null,"",{"$f":"IF(C11<>\"\",IF(AND(E11=MIN( IF( $F$4:$F$23=F11, $E$4:$E$23)),E11>0),1,0),\"\")","v":""},""]
[null,null,null,null,null,"",{"$f":"IF(C12<>\"\",IF(AND(E12=MIN( IF( $F$4:$F$23=F12, $E$4:$E$23)),E12>0),1,0),\"\")","v":""},""]
[null,null,null,null,null,"",{"$f":"IF(C13<>\"\",IF(AND(E13=MIN( IF( $F$4:$F$23=F13, $E$4:$E$23)),E13>0),1,0),\"\")","v":""},""]
[null,null,null,null,null,"",{"$f":"IF(C14<>\"\",IF(AND(E14=MIN( IF( $F$4:$F$23=F14, $E$4:$E$23)),E14>0),1,0),\"\")","v":""},""]
[null,null,null,null,null,"",{"$f":"IF(C15<>\"\",IF(AND(E15=MIN( IF( $F$4:$F$23=F15, $E$4:$E$23)),E15>0),1,0),\"\")","v":""},""]
[null,null,null,null,null,"",{"$f":"IF(C16<>\"\",IF(AND(E16=MIN( IF( $F$4:$F$23=F16, $E$4:$E$23)),E16>0),1,0),\"\")","v":""},""]
[null,null,null,null,null,"",{"$f":"IF(C17<>\"\",IF(AND(E17=MIN( IF( $F$4:$F$23=F17, $E$4:$E$23)),E17>0),1,0),\"\")","v":""},""]
[null,null,null,null,null,"",{"$f":"IF(C18<>\"\",IF(AND(E18=MIN( IF( $F$4:$F$23=F18, $E$4:$E$23)),E18>0),1,0),\"\")","v":""},""]
[null,null,null,null,null,"",{"$f":"IF(C19<>\"\",IF(AND(E19=MIN( IF( $F$4:$F$23=F19, $E$4:$E$23)),E19>0),1,0),\"\")","v":""},""]
[null,null,null,null,null,"",{"$f":"IF(C20<>\"\",IF(AND(E20=MIN( IF( $F$4:$F$23=F20, $E$4:$E$23)),E20>0),1,0),\"\")","v":""},""]
[null,null,null,null,null,"",{"$f":"IF(C21<>\"\",IF(AND(E21=MIN( IF( $F$4:$F$23=F21, $E$4:$E$23)),E21>0),1,0),\"\")","v":""},""]
[null,null,null,null,null,"",{"$f":"IF(C22<>\"\",IF(AND(E22=MIN( IF( $F$4:$F$23=F22, $E$4:$E$23)),E22>0),1,0),\"\")","v":""},""]
[null,null,null,null,null,"",{"$f":"IF(C23<>\"\",IF(AND(E23=MIN( IF( $F$4:$F$23=F23, $E$4:$E$23)),E23>0),1,0),\"\")","v":""},""]
[]
[null,"Driver","Lane","Slowest Lap Time","Fastest Lap Time","Average Lap Time","Total Laps"]

{"sheet":"SumSheet","index":7,"n_rows":63,"n_cols":80,"rows_kept":63,"cut":false,"hidden":false,"merged":[[6,53,6,63],[6,64,6,67],[6,68,6,71],[6,72,6,79],[41,1,41,2],[6,1,7,1],[6,3,6,8],[6,9,6,19],[6,20,6,30],[6,31,6,41],[6,42,6,52],[6,2,7,2]]}
[]
[]
[]
[]
[]
[null,1,{"$f":"B6+1","v":2},{"$f":"C6+1","v":3},4,5,6,7,8,9,10,11,12,13,14,15,16,17,18,19,20,21,22,23,24,25,26,27,28,29,30,31,32,33,34,35,36,37,38,39,40,41,42,43,44,45,46,47,48,49,50,51,52,53,54,55,56,57,58,59,60,61,62,63,64,65,66,{"$f":"BO6+1","v":67},68,69,70,71,72,73,74,75,76,77,78,79]
[null,"Racer","Group","Round 1",null,null,null,null,null,"Round 2",null,null,null,null,null,null,null,null,null,null,"Round 3",null,null,null,null,null,null,null,null,null,null,"Round 4",null,null,null,null,null,null,null,null,null,null,"Round 5",null,null,null,null,null,null,null,null,null,null,"Round 6",null,null,null,null,null,null,null,null,null,null,"Total",null,null,null,"Dropped Round",null,null,null,"Final Classification"]
[null,null,null,"Laps","Points","Fastest Lap","Total Round Points","Class Rank","Rank","Laps","Points","Fastest Lap","Total Round Points","Running Series Points","Class Rank","Running Class Rank","Change in Class Rank","Overall Rank","Running Overall Rank","Change in Overall Rank","Laps","Points","Fastest Lap","Total Round Points","Running Series Points","Class Rank","Running Class Rank","Change in Class Rank","Overall Rank","Running Overall Rank","Change in Overall Rank","Laps","Points","Fastest Lap","Total Round Points","Running Series Points","Class Rank","Running Class Rank","Change in Class Rank","Overall Rank","Running Overall Rank","Change in Overall Rank","Laps","Points","Fastest Lap","Total Round Points","Running Series Points","Class Rank","Running Class Rank","Change in Class Rank","Overall Rank","Running Overall Rank","Change in Overall Rank","Laps","Points","Fastest Lap","Total Round Points","Running Series Points","Class Rank","Running Class Rank","Change in Class Rank","Overall Rank","Running Overall Rank","Change in Overall Rank","Rounds Run","Points","Fastest Laps","Laps","Round","Points","Fastest Laps","Laps","Points","Fastest Laps","Total Points","Laps","Class Rank","Change in Class Rank","Overall Rank","Change in Overall Rank"]
[null,"Ary B.","A",{"$f":"IF(ISNA(VLOOKUP($B9,Round1Results,2,FALSE)),0,VLOOKUP($B9,Round1Results,2,FALSE))","v":0},{"$f":"IF(ISNA(VLOOKUP($B9,Round1Results,6,FALSE)),0,VLOOKUP($B9,Round1Results,6,FALSE)-F9)","v":0},{"$f":"IF(ISNA(VLOOKUP($B9,Round1Results,5,FALSE)),0,VLOOKUP($B9,Round1Results,5,FALSE))","v":0},{"$f":"SUM(E9:F9)","v":0},{"$f":"IF($BP9>0,SUMPRODUCT(--(C9=C$9:C$37),--(G9<(G$9:G$37)))+1,0)","v":0},{"$f":"IF($BP9>0,RANK(G9,G$9:G$37),0)","v":0},{"$f":"IF(ISNA(VLOOKUP($B9,Round2Results,2,FALSE)),0,VLOOKUP($B9,Round2Results,2,FALSE))","v":0},{"$f":"IF(ISNA(VLOOKUP($B9,Round2Results,6,FALSE)),0,VLOOKUP($B9,Round2Results,6,FALSE)-L9)","v":0},{"$f":"IF(ISNA(VLOOKUP($B9,Round2Results,5,FALSE)),0,VLOOKUP($B9,Round2Results,5,FALSE))","v":0},{"$f":"SUM(K9:L9)","v":0},{"$f":"G9+M9","v":0},{"$f":"IF(J9>0,SUMPRODUCT(--($C9=$C$9:$C$37),--(M9<(M$9:M$37)))+1,0)","v":0},{"$f":"IF($BP9>0,SUMPRODUCT(--($C9=$C$9:$C$37),--(N9<(N$9:N$37)))+1,0)","v":0},{"$f":"IF(H9=0,0,H9-P9)","v":0},{"$f":"IF(J9>0,RANK(M9,M$9:M$37),0)","v":0},{"$f":"IF($BP9>0,RANK(N9,N$9:N$37),0)","v":0},{"$f":"IF(I9=0,0,I9-S9)","v":0},{"$f":"IF(ISNA(VLOOKUP($B9,Round3Results,2,FALSE)),0,VLOOKUP($B9,Round3Results,2,FALSE))","v":0},{"$f":"IF(ISNA(VLOOKUP($B9,Round3Results,6,FALSE)),0,VLOOKUP($B9,Round3Results,6,FALSE)-W9)","v":0},{"$f":"IF(ISNA(VLOOKUP($B9,Round3Results,5,FALSE)),0,VLOOKUP($B9,Round3Results,5,FALSE))","v":0},{"$f":"SUM(V9:W9)","v":0},{"$f":"N9+X9","v":0},{"$f":"IF(U9>0,SUMPRODUCT(--($C9=$C$9:$C$37),--(X9<(X$9:X$37)))+1,0)","v":0},{"$f":"IF($BP9>0,SUMPRODUCT(--($C9=$C$9:$C$37),--(Y9<(Y$9:Y$37)))+1,0)","v":0},{"$f":"IF(P9=0,0,P9-AA9)","v":0},{"$f":"IF(U9>0,RANK(X9,X$9:X$37),0)","v":0},{"$f":"IF($BP9>0,RANK(Y9,Y$9:Y$37),0)","v":0},{"$f":"IF(S9=0,0,S9-AD9)","v":0},{"$f":"IF(ISNA(VLOOKUP($B9,Round4Results,2,FALSE)),0,VLOOKUP($B9,Round4Results,2,FALSE))","v":0},{"$f":"IF(ISNA(VLOOKUP($B9,Round4Results,6,FALSE)),0,VLOOKUP($B9,Round4Results,6,FALSE)-AH9)","v":0},{"$f":"IF(ISNA(VLOOKUP($B9,Round4Results,5,FALSE)),0,VLOOKUP($B9,Round4Results,5,FALSE))","v":0},{"$f":"SUM(AG9:AH9)","v":0},{"$f":"Y9+AI9","v":0},{"$f":"IF(AF9>0,SUMPRODUCT(--($C9=$C$9:$C$37),--(AI9<(AI$9:AI$37)))+1,0)","v":0},{"$f":"IF($BP9>0,SUMPRODUCT(--($C9=$C$9:$C$37),--(AJ9<(AJ$9:AJ$37)))+1,0)","v":0},{"$f":"IF(AA9=0,0,AA9-AL9)","v":0},{"$f":"IF(AF9>0,RANK(AI9,AI$9:AI$37),0)","v":0},{"$f":"IF($BP9>0,RANK(AJ9,AJ$9:AJ$37),0)","v":0},{"$f":"IF(AD9=0,0,AD9-AO9)","v":0},{"$f":"IF(ISNA(VLOOKUP($B9,Round5Results,2,FALSE)),0,VLOOKUP($B9,Round5Results,2,FALSE))","v":0},{"$f":"IF(ISNA(VLOOKUP($B9,Round5Results,6,FALSE)),0,VLOOKUP($B9,Round5Results,6,FALSE)-AS9)","v":0},{"$f":"IF(ISNA(VLOOKUP($B9,Round5Results,5,FALSE)),0,VLOOKUP($B9,Round5Results,5,FALSE))","v":0},{"$f":"SUM(AR9:AS9)","v":0},{"$f":"AJ9+AT9","v":0},{"$f":"IF(AQ9>0,SUMPRODUCT(--($C9=$C$9:$C$37),--(AT9<(AT$9:AT$37)))+1,0)","v":0},{"$f":"IF($BP9>0,SUMPRODUCT(--($C9=$C$9:$C$37),--(AU9<(AU$9:AU$37)))+1,0)","v":0},{"$f":"IF(AL9=0,0,AL9-AW9)","v":0},{"$f":"IF(AQ9>0,RANK(AT9,AT$9:AT$37),0)","v":0},{"$f":"IF($BP9>0,RANK(AU9,AU$9:AU$37),0)","v":0},{"$f":"IF(AO9=0,0,AO9-AZ9)","v":0},{"$f":"IF(ISNA(VLOOKUP($B9,Round6Results,2,FALSE)),0,VLOOKUP($B9,Round6Results,2,FALSE))","v":0},{"$f":"IF(ISNA(VLOOKUP($B9,Round6Results,6,FALSE)),0,VLOOKUP($B9,Round6Results,6,FALSE)-BD9)","v":0},{"$f":"IF(ISNA(VLOOKUP($B9,Round6Results,5,FALSE)),0,VLOOKUP($B9,Round6Results,5,FALSE))","v":0},{"$f":"SUM(BC9:BD9)","v":0},{"$f":"AU9+BE9","v":0},{"$f":"IF(BB9>0,SUMPRODUCT(--($C9=$C$9:$C$37),--(BE9<(BE$9:BE$37)))+1,0)","v":0},{"$f":"IF($BP9>0,SUMPRODUCT(--($C9=$C$9:$C$37),--(BF9<(BF$9:BF$37)))+1,0)","v":0},{"$f":"IF(AW9=0,0,AW9-BH9)","v":0},{"$f":"IF(BB9>0,RANK(BE9,BE$9:BE$37),0)","v":0},{"$f":"IF($BP9>0,RANK(BF9,BF$9:BF$37),0)","v":0},{"$f":"IF(AZ9=0,0,AZ9-BK9)","v":0},{"$f":"COUNTIF(D9,\">0\")+COUNTIF(J9,\">0\")+COUNTIF(U9,\">0\")+COUNTIF(AF9,\">0\")+COUNTIF(AQ9,\">0\")+COUNTIF(BB9,\">0\")","v":0},{"$f":"E9+K9+V9+AG9+AR9+BC9","v":0},{"$f":"F9+L9+W9+AH9+AS9+BD9","v":0},{"$f":"D9+J9+U9+AF9+AQ9+BB9","v":0},null,{"$f":"IF($BQ$9=1,E9,IF($BQ9=2,K9,IF($BQ9=3,V9,IF($BQ9=4,AG9,IF($BQ9=5,AR9,IF($BQ9=6,BC9,0))))))","v":0},{"$f":"IF($BQ$9=1,F9,IF($BQ9=2,L9,IF($BQ9=3,W9,IF($BQ9=4,AH9,IF($BQ9=5,AS9,IF($BQ9=6,BD9,0))))))","v":0},{"$f":"IF($BQ$9=1,D9,IF($BQ9=2,J9,IF($BQ9=3,U9,IF($BQ9=4,AF9,IF($BQ9=5,AP9,IF($BQ9=6,BB9,0))))))","v":0},{"$f":"E9+K9+V9+AG9+AR9+BC9-BR9","v":0},{"$f":"F9+L9+W9+AH9+AS9+BD9-BS9","v":0},{"$f":"BU9+BV9","v":0},{"$f":"D9+J9+U9+AF9+AQ9+BB9-BT9","v":0},{"$f":"IF($BW9>0,(SUMPRODUCT(($C9=Group_Range)*($BW9<(Total_Point_Range)))+1)+SUMPRODUCT(($C9=Group_Range)*(Total_Point_Range=$BW9)*(Total_Lap_Range>$BX9)),0)","v":0},{"$f":"IF(AND(B9<>\"\",RoundsRun>1),IF(IF(RoundsRun=2,VLOOKUP(B9,SeriesSummary,Round2ClassRankChange,FALSE),IF(RoundsRun=3,VLOOKUP(B9,SeriesSummary,Round3ClassRankChange,FALSE),IF(RoundsRun=4,VLOOKUP(B9,SeriesSummary,Round4ClassRankChange,FALSE),IF(RoundsRun=5,VLOOKUP(B9,SeriesSummary,Round5ClassRankChange,FALSE),IF(RoundsRun=6,VLOOKUP(B9,SeriesSummary,Round6ClassRankChange,FALSE),\"-\")))))>0,\"+\"&IF(RoundsRun=2,VLOOKUP(B9,SeriesSummary,Round2ClassRankChange,FALSE),IF(RoundsRun=3,VLOOKUP(B9,SeriesSummary,Round3ClassRankChange,FALSE),IF(RoundsRun=4,VLOOKUP(B9,SeriesSummary,Round4ClassRankChange,FALSE),IF(RoundsRun=5,VLOOKUP(B9,SeriesSummary,Round5ClassRankChange,FALSE),IF(RoundsRun=6,VLOOKUP(B9,SeriesSummary,Round6ClassRankChange,FALSE),\"-\"))))),IF((IF(RoundsRun=2,VLOOKUP(B9,SeriesSummary,Round2ClassRankChange,FALSE),IF(RoundsRun=3,VLOOKUP(B9,SeriesSummary,Round3ClassRankChange,FALSE),IF(RoundsRun=4,VLOOKUP(B9,SeriesSummary,Round4ClassRankChange,FALSE),IF(RoundsRun=5,VLOOKUP(B9,SeriesSummary,Round5ClassRankChange,FALSE),IF(RoundsRun=6,VLOOKUP(B9,SeriesSummary,Round6ClassRankChange,FALSE),\"-\"))))))=0,\"-\",(IF(RoundsRun=2,VLOOKUP(B9,SeriesSummary,Round2ClassRankChange,FALSE),IF(RoundsRun=3,VLOOKUP(B9,SeriesSummary,Round3ClassRankChange,FALSE),IF(RoundsRun=4,VLOOKUP(B9,SeriesSummary,Round4ClassRankChange,FALSE),IF(RoundsRun=5,VLOOKUP(B9,SeriesSummary,Round5ClassRankChange,FALSE),IF(RoundsRun=6,VLOOKUP(B9,SeriesSummary,Round6ClassRankChange,FALSE),\"-\")))))))),\"-\")","v":"-"},{"$f":"IF(BM9>0,RANK(BW9,Total_Point_Range)+SUMPRODUCT((Total_Point_Range=BW9)*(Total_Lap_Range>BX9)),0)","v":0},{"$f":"IF(AND(B9<>\"\",RoundsRun>1),IF(IF(RoundsRun=2,VLOOKUP(B9,SeriesSummary,Round2RankChange,FALSE),IF(RoundsRun=3,VLOOKUP(B9,SeriesSummary,Round3RankChange,FALSE),IF(RoundsRun=4,VLOOKUP(B9,SeriesSummary,Round4RankChange,FALSE),IF(RoundsRun=5,VLOOKUP(B9,SeriesSummary,Round5RankChange,FALSE),IF(RoundsRun=6,VLOOKUP(B9,SeriesSummary,Round6RankChange,FALSE),\"-\")))))>0,\"+\"&IF(RoundsRun=2,VLOOKUP(B9,SeriesSummary,Round2RankChange,FALSE),IF(RoundsRun=3,VLOOKUP(B9,SeriesSummary,Round3RankChange,FALSE),IF(RoundsRun=4,VLOOKUP(B9,SeriesSummary,Round4RankChange,FALSE),IF(RoundsRun=5,VLOOKUP(B9,SeriesSummary,Round5RankChange,FALSE),IF(RoundsRun=6,VLOOKUP(B9,SeriesSummary,Round6RankChange,FALSE),\"-\"))))),IF((IF(RoundsRun=2,VLOOKUP(B9,SeriesSummary,Round2RankChange,FALSE),IF(RoundsRun=3,VLOOKUP(B9,SeriesSummary,Round3RankChange,FALSE),IF(RoundsRun=4,VLOOKUP(B9,SeriesSummary,Round4RankChange,FALSE),IF(RoundsRun=5,VLOOKUP(B9,SeriesSummary,Round5RankChange,FALSE),IF(RoundsRun=6,VLOOKUP(B9,SeriesSummary,Round6RankChange,FALSE),\"-\"))))))=0,\"-\",(IF(RoundsRun=2,VLOOKUP(B9,SeriesSummary,Round2RankChange,FALSE),IF(RoundsRun=3,VLOOKUP(B9,SeriesSummary,Round3RankChange,FALSE),IF(RoundsRun=4,VLOOKUP(B9,SeriesSummary,Round4RankChange,FALSE),IF(RoundsRun=5,VLOOKUP(B9,SeriesSummary,Round5RankChange,FALSE),IF(RoundsRun=6,VLOOKUP(B9,SeriesSummary,Round6RankChange,FALSE),\"-\")))))))),\"-\")","v":"-"}]
[null,"Brian H.","A",0,0,0,0,0,0,0,0,0,0,0,0,0,0,0,0,0,0,0,0,0,0,0,0,0,0,0,0,0,0,0,0,0,0,0,0,0,0,0,0,0,0,0,0,0,0,0,0,0,0,0,0,0,0,0,0,0,0,0,0,0,0,0,0,0,null,0,0,{"$f":"IF($BQ$9=1,D10,IF($BQ10=2,J10,IF($BQ10=3,U10,IF($BQ10=4,AF10,IF($BQ10=5,AP10,IF($BQ10=6,BB10,0))))))","v":0},0,0,0,0,0,"-",0,"-"]
[null,"David C.","A",207,16,0,16,5,5,0,0,0,0,16,0,5,0,0,5,0,0,0,0,0,16,0,5,0,0,5,0,0,0,0,0,16,0,5,0,0,5,0,0,0,0,0,16,0,5,0,0,5,0,0,0,0,0,16,0,5,0,0,5,0,1,16,0,207,null,0,0,{"$f":"IF($BQ$9=1,D11,IF($BQ11=2,J11,IF($BQ11=3,U11,IF($BQ11=4,AF11,IF($BQ11=5,AP11,IF($BQ11=6,BB11,0))))))","v":0},16,0,16,207,5,"-",5,"-"]
[null,"Jordan C.","A",0,0,0,0,0,0,0,0,0,0,0,0,0,0,0,0,0,0,0,0,0,0,0,0,0,0,0,0,0,0,0,0,0,0,0,0,0,0,0,0,0,0,0,0,0,0,0,0,0,0,0,0,0,0,0,0,0,0,0,0,0,0,0,0,0,null,0,0,0,0,0,0,0,0,"-",0,"-"]
[null,"Marty M.","A",219.8,19,1,20,1,1,0,0,0,0,20,0,1,0,0,1,0,0,0,0,0,20,0,1,0,0,1,0,0,0,0,0,20,0,1,0,0,1,0,0,0,0,0,20,0,1,0,0,1,0,0,0,0,0,20,0,1,0,0,1,0,1,19,1,219.8,null,0,0,0,19,1,20,219.8,2,"-",2,"-"]
[null,"Roy M.","A",0,0,0,0,0,0,0,0,0,0,0,0,0,0,0,0,0,0,0,0,0,0,0,0,0,0,0,0,0,0,0,0,0,0,0,0,0,0,0,0,0,0,0,0,0,0,0,0,0,0,0,0,0,0,0,0,0,0,0,0,0,0,0,0,0,null,0,0,0,0,0,0,0,0,"-",0,"-"]
[null,"Russell M.","A",208.65,17,0,17,4,4,0,0,0,0,17,0,4,0,0,4,0,0,0,0,0,17,0,4,0,0,4,0,0,0,0,0,17,0,4,0,0,4,0,0,0,0,0,17,0,4,0,0,4,0,0,0,0,0,17,0,4,0,0,4,0,1,17,0,208.65,null,0,0,0,17,0,17,208.65,4,"-",4,"-"]
[null,"Shawn G.","A",222.24,20,0,20,1,1,0,0,0,0,20,0,1,0,0,1,0,0,0,0,0,20,0,1,0,0,1,0,0,0,0,0,20,0,1,0,0,1,0,0,0,0,0,20,0,1,0,0,1,0,0,0,0,0,20,0,1,0,0,1,0,1,20,0,222.24,null,0,0,0,20,0,20,222.24,1,"-",1,"-"]
[null,"Stephen B.","A",214.8,18,0,18,3,3,0,0,0,0,18,0,3,0,0,3,0,0,0,0,0,18,0,3,0,0,3,0,0,0,0,0,18,0,3,0,0,3,0,0,0,0,0,18,0,3,0,0,3,0,0,0,0,0,18,0,3,0,0,3,0,1,18,0,214.8,null,0,0,0,18,0,18,214.8,3,"-",3,"-"]
[null,"Alejandro G.","B",188.29,12,0,12,4,9,0,0,0,0,12,0,4,0,0,9,0,0,0,0,0,12,0,4,0,0,9,0,0,0,0,0,12,0,4,0,0,9,0,0,0,0,0,12,0,4,0,0,9,0,0,0,0,0,12,0,4,0,0,9,0,1,12,0,188.29,null,0,0,0,12,0,12,188.29,4,"-",9,"-"]
[null,"Austin C.","B",0,0,0,0,0,0,0,0,0,0,0,0,0,0,0,0,0,0,0,0,0,0,0,0,0,0,0,0,0,0,0,0,0,0,0,0,0,0,0,0,0,0,0,0,0,0,0,0,0,0,0,0,0,0,0,0,0,0,0,0,0,0,0,0,0,null,0,0,0,0,0,0,0,0,"-",0,"-"]
[null,"Bob L.","B",0,0,0,0,0,0,0,0,0,0,0,0,0,0,0,0,0,0,0,0,0,0,0,0,0,0,0,0,0,0,0,0,0,0,0,0,0,0,0,0,0,0,0,0,0,0,0,0,0,0,0,0,0,0,0,0,0,0,0,0,0,0,0,0,0,null,0,0,0,0,0,0,0,0,"-",0,"-"]
[null,"Brett L.","B",189,13,1,14,2,7,0,0,0,0,14,0,2,0,0,7,0,0,0,0,0,14,0,2,0,0,7,0,0,0,0,0,14,0,2,0,0,7,0,0,0,0,0,14,0,2,0,0,7,0,0,0,0,0,14,0,2,0,0,7,0,1,13,1,189,null,0,0,0,13,1,14,189,3,"-",8,"-"]
[null,"John B.","B",171.8,10,0,10,6,11,0,0,0,0,10,0,6,0,0,11,0,0,0,0,0,10,0,6,0,0,11,0,0,0,0,0,10,0,6,0,0,11,0,0,0,0,0,10,0,6,0,0,11,0,0,0,0,0,10,0,6,0,0,11,0,1,10,0,171.8,null,0,0,0,10,0,10,171.8,6,"-",11,"-"]
[null,"Kyle M.","B",0,0,0,0,0,0,0,0,0,0,0,0,0,0,0,0,0,0,0,0,0,0,0,0,0,0,0,0,0,0,0,0,0,0,0,0,0,0,0,0,0,0,0,0,0,0,0,0,0,0,0,0,0,0,0,0,0,0,0,0,0,0,0,0,0,null,0,0,0,0,0,0,0,0,"-",0,"-"]
[null,"Mark L.","B",190.45,14,0,14,2,7,0,0,0,0,14,0,2,0,0,7,0,0,0,0,0,14,0,2,0,0,7,0,0,0,0,0,14,0,2,0,0,7,0,0,0,0,0,14,0,2,0,0,7,0,0,0,0,0,14,0,2,0,0,7,0,1,14,0,190.45,null,0,0,0,14,0,14,190.45,2,"-",7,"-"]
[null,"Max M.","B",0,0,0,0,0,0,0,0,0,0,0,0,0,0,0,0,0,0,0,0,0,0,0,0,0,0,0,0,0,0,0,0,0,0,0,0,0,0,0,0,0,0,0,0,0,0,0,0,0,0,0,0,0,0,0,0,0,0,0,0,0,0,0,0,0,null,0,0,0,0,0,0,0,0,"-",0,"-"]
[null,"Mitch A.","B",185.24,11,0,11,5,10,0,0,0,0,11,0,5,0,0,10,0,0,0,0,0,11,0,5,0,0,10,0,0,0,0,0,11,0,5,0,0,10,0,0,0,0,0,11,0,5,0,0,10,0,0,0,0,0,11,0,5,0,0,10,0,1,11,0,185.24,null,0,0,0,11,0,11,185.24,5,"-",10,"-"]
[null,"Nick M.","B",0,0,0,0,0,0,0,0,0,0,0,0,0,0,0,0,0,0,0,0,0,0,0,0,0,0,0,0,0,0,0,0,0,0,0,0,0,0,0,0,0,0,0,0,0,0,0,0,0,0,0,0,0,0,0,0,0,0,0,0,0,0,0,0,0,null,0,0,0,0,0,0,0,0,"-",0,"-"]
[null,"Randy A.","B",159.80000000000001,9,0,9,7,12,0,0,0,0,9,0,7,0,0,12,0,0,0,0,0,9,0,7,0,0,12,0,0,0,0,0,9,0,7,0,0,12,0,0,0,0,0,9,0,7,0,0,12,0,0,0,0,0,9,0,7,0,0,12,0,1,9,0,159.80000000000001,null,0,0,0,9,0,9,159.80000000000001,7,"-",12,"-"]
[null,"Rich C.","B",{"$f":"IF(ISNA(VLOOKUP($B29,Round1Results,2,FALSE)),0,VLOOKUP($B29,Round1Results,2,FALSE))","v":205.32},{"$f":"IF(ISNA(VLOOKUP($B29,Round1Results,6,FALSE)),0,VLOOKUP($B29,Round1Results,6,FALSE)-F29)","v":15},{"$f":"IF(ISNA(VLOOKUP($B29,Round1Results,5,FALSE)),0,VLOOKUP($B29,Round1Results,5,FALSE))","v":0},{"$f":"SUM(E29:F29)","v":15},1,6,{"$f":"IF(ISNA(VLOOKUP($B29,Round2Results,2,FALSE)),0,VLOOKUP($B29,Round2Results,2,FALSE))","v":0},{"$f":"IF(ISNA(VLOOKUP($B29,Round2Results,6,FALSE)),0,VLOOKUP($B29,Round2Results,6,FALSE)-L29)","v":0},{"$f":"IF(ISNA(VLOOKUP($B29,Round2Results,5,FALSE)),0,VLOOKUP($B29,Round2Results,5,FALSE))","v":0},{"$f":"SUM(K29:L29)","v":0},{"$f":"G29+M29","v":15},0,1,{"$f":"IF(H29=0,0,H29-P29)","v":0},0,6,{"$f":"IF(I29=0,0,I29-S29)","v":0},{"$f":"IF(ISNA(VLOOKUP($B29,Round3Results,2,FALSE)),0,VLOOKUP($B29,Round3Results,2,FALSE))","v":0},{"$f":"IF(ISNA(VLOOKUP($B29,Round3Results,6,FALSE)),0,VLOOKUP($B29,Round3Results,6,FALSE)-W29)","v":0},{"$f":"IF(ISNA(VLOOKUP($B29,Round3Results,5,FALSE)),0,VLOOKUP($B29,Round3Results,5,FALSE))","v":0},{"$f":"SUM(V29:W29)","v":0},{"$f":"N29+X29","v":15},0,1,{"$f":"IF(P29=0,0,P29-AA29)","v":0},0,6,{"$f":"IF(S29=0,0,S29-AD29)","v":0},{"$f":"IF(ISNA(VLOOKUP($B29,Round4Results,2,FALSE)),0,VLOOKUP($B29,Round4Results,2,FALSE))","v":0},{"$f":"IF(ISNA(VLOOKUP($B29,Round4Results,6,FALSE)),0,VLOOKUP($B29,Round4Results,6,FALSE)-AH29)","v":0},{"$f":"IF(ISNA(VLOOKUP($B29,Round4Results,5,FALSE)),0,VLOOKUP($B29,Round4Results,5,FALSE))","v":0},{"$f":"SUM(AG29:AH29)","v":0},{"$f":"Y29+AI29","v":15},0,1,{"$f":"IF(AA29=0,0,AA29-AL29)","v":0},0,6,{"$f":"IF(AD29=0,0,AD29-AO29)","v":0},{"$f":"IF(ISNA(VLOOKUP($B29,Round5Results,2,FALSE)),0,VLOOKUP($B29,Round5Results,2,FALSE))","v":0},{"$f":"IF(ISNA(VLOOKUP($B29,Round5Results,6,FALSE)),0,VLOOKUP($B29,Round5Results,6,FALSE)-AS29)","v":0},{"$f":"IF(ISNA(VLOOKUP($B29,Round5Results,5,FALSE)),0,VLOOKUP($B29,Round5Results,5,FALSE))","v":0},{"$f":"SUM(AR29:AS29)","v":0},{"$f":"AJ29+AT29","v":15},0,1,{"$f":"IF(AL29=0,0,AL29-AW29)","v":0},0,6,{"$f":"IF(AO29=0,0,AO29-AZ29)","v":0},{"$f":"IF(ISNA(VLOOKUP($B29,Round6Results,2,FALSE)),0,VLOOKUP($B29,Round6Results,2,FALSE))","v":0},{"$f":"IF(ISNA(VLOOKUP($B29,Round6Results,6,FALSE)),0,VLOOKUP($B29,Round6Results,6,FALSE)-BD29)","v":0},{"$f":"IF(ISNA(VLOOKUP($B29,Round6Results,5,FALSE)),0,VLOOKUP($B29,Round6Results,5,FALSE))","v":0},{"$f":"SUM(BC29:BD29)","v":0},{"$f":"AU29+BE29","v":15},0,1,{"$f":"IF(AW29=0,0,AW29-BH29)","v":0},0,6,{"$f":"IF(AZ29=0,0,AZ29-BK29)","v":0},{"$f":"COUNTIF(D29,\">0\")+COUNTIF(J29,\">0\")+COUNTIF(U29,\">0\")+COUNTIF(AF29,\">0\")+COUNTIF(AQ29,\">0\")+COUNTIF(BB29,\">0\")","v":1},{"$f":"E29+K29+V29+AG29+AR29+BC29","v":15},{"$f":"F29+L29+W29+AH29+AS29+BD29","v":0},{"$f":"D29+J29+U29+AF29+AQ29+BB29","v":205.32},null,{"$f":"IF($BQ$9=1,E29,IF($BQ29=2,K29,IF($BQ29=3,V29,IF($BQ29=4,AG29,IF($BQ29=5,AR29,IF($BQ29=6,BC29,0))))))","v":0},{"$f":"IF($BQ$9=1,F29,IF($BQ29=2,L29,IF($BQ29=3,W29,IF($BQ29=4,AH29,IF($BQ29=5,AS29,IF($BQ29=6,BD29,0))))))","v":0},{"$f":"IF($BQ$9=1,D29,IF($BQ29=2,J29,IF($BQ29=3,U29,IF($BQ29=4,AF29,IF($BQ29=5,AP29,IF($BQ29=6,BB29,0))))))","v":0},{"$f":"E29+K29+V29+AG29+AR29+BC29-BR29","v":15},{"$f":"F29+L29+W29+AH29+AS29+BD29-BS29","v":0},{"$f":"BU29+BV29","v":15},{"$f":"D29+J29+U29+AF29+AQ29+BB29-BT29","v":205.32},{"$f":"IF($BW29>0,(SUMPRODUCT(($C29=Group_Range)*($BW29<(Total_Point_Range)))+1)+SUMPRODUCT(($C29=Group_Range)*(Total_Point_Range=$BW29)*(Total_Lap_Range>$BX29)),0)","v":1},{"$f":"IF(AND(B29<>\"\",RoundsRun>1),IF(IF(RoundsRun=2,VLOOKUP(B29,SeriesSummary,Round2ClassRankChange,FALSE),IF(RoundsRun=3,VLOOKUP(B29,SeriesSummary,Round3ClassRankChange,FALSE),IF(RoundsRun=4,VLOOKUP(B29,SeriesSummary,Round4ClassRankChange,FALSE),IF(RoundsRun=5,VLOOKUP(B29,SeriesSummary,Round5ClassRankChange,FALSE),IF(RoundsRun=6,VLOOKUP(B29,SeriesSummary,Round6ClassRankChange,FALSE),\"-\")))))>0,\"+\"&IF(RoundsRun=2,VLOOKUP(B29,SeriesSummary,Round2ClassRankChange,FALSE),IF(RoundsRun=3,VLOOKUP(B29,SeriesSummary,Round3ClassRankChange,FALSE),IF(RoundsRun=4,VLOOKUP(B29,SeriesSummary,Round4ClassRankChange,FALSE),IF(RoundsRun=5,VLOOKUP(B29,SeriesSummary,Round5ClassRankChange,FALSE),IF(RoundsRun=6,VLOOKUP(B29,SeriesSummary,Round6ClassRankChange,FALSE),\"-\"))))),IF((IF(RoundsRun=2,VLOOKUP(B29,SeriesSummary,Round2ClassRankChange,FALSE),IF(RoundsRun=3,VLOOKUP(B29,SeriesSummary,Round3ClassRankChange,FALSE),IF(RoundsRun=4,VLOOKUP(B29,SeriesSummary,Round4ClassRankChange,FALSE),IF(RoundsRun=5,VLOOKUP(B29,SeriesSummary,Round5ClassRankChange,FALSE),IF(RoundsRun=6,VLOOKUP(B29,SeriesSummary,Round6ClassRankChange,FALSE),\"-\"))))))=0,\"-\",(IF(RoundsRun=2,VLOOKUP(B29,SeriesSummary,Round2ClassRankChange,FALSE),IF(RoundsRun=3,VLOOKUP(B29,SeriesSummary,Round3ClassRankChange,FALSE),IF(RoundsRun=4,VLOOKUP(B29,SeriesSummary,Round4ClassRankChange,FALSE),IF(RoundsRun=5,VLOOKUP(B29,SeriesSummary,Round5ClassRankChange,FALSE),IF(RoundsRun=6,VLOOKUP(B29,SeriesSummary,Round6ClassRankChange,FALSE),\"-\")))))))),\"-\")","v":"-"},{"$f":"IF(BM29>0,RANK(BW29,Total_Point_Range)+SUMPRODUCT((Total_Point_Range=BW29)*(Total_Lap_Range>BX29)),0)","v":6},{"$f":"IF(AND(B29<>\"\",RoundsRun>1),IF(IF(RoundsRun=2,VLOOKUP(B29,SeriesSummary,Round2RankChange,FALSE),IF(RoundsRun=3,VLOOKUP(B29,SeriesSummary,Round3RankChange,FALSE),IF(RoundsRun=4,VLOOKUP(B29,SeriesSummary,Round4RankChange,FALSE),IF(RoundsRun=5,VLOOKUP(B29,SeriesSummary,Round5RankChange,FALSE),IF(RoundsRun=6,VLOOKUP(B29,SeriesSummary,Round6RankChange,FALSE),\"-\")))))>0,\"+\"&IF(RoundsRun=2,VLOOKUP(B29,SeriesSummary,Round2RankChange,FALSE),IF(RoundsRun=3,VLOOKUP(B29,SeriesSummary,Round3RankChange,FALSE),IF(RoundsRun=4,VLOOKUP(B29,SeriesSummary,Round4RankChange,FALSE),IF(RoundsRun=5,VLOOKUP(B29,SeriesSummary,Round5RankChange,FALSE),IF(RoundsRun=6,VLOOKUP(B29,SeriesSummary,Round6RankChange,FALSE),\"-\"))))),IF((IF(RoundsRun=2,VLOOKUP(B29,SeriesSummary,Round2RankChange,FALSE),IF(RoundsRun=3,VLOOKUP(B29,SeriesSummary,Round3RankChange,FALSE),IF(RoundsRun=4,VLOOKUP(B29,SeriesSummary,Round4RankChange,FALSE),IF(RoundsRun=5,VLOOKUP(B29,SeriesSummary,Round5RankChange,FALSE),IF(RoundsRun=6,VLOOKUP(B29,SeriesSummary,Round6RankChange,FALSE),\"-\"))))))=0,\"-\",(IF(RoundsRun=2,VLOOKUP(B29,SeriesSummary,Round2RankChange,FALSE),IF(RoundsRun=3,VLOOKUP(B29,SeriesSummary,Round3RankChange,FALSE),IF(RoundsRun=4,VLOOKUP(B29,SeriesSummary,Round4RankChange,FALSE),IF(RoundsRun=5,VLOOKUP(B29,SeriesSummary,Round5RankChange,FALSE),IF(RoundsRun=6,VLOOKUP(B29,SeriesSummary,Round6RankChange,FALSE),\"-\")))))))),\"-\")","v":"-"}]
[null,null,null,0,0,0,0,0,0,0,0,0,0,0,0,0,0,0,0,0,0,0,0,0,0,0,0,0,0,0,0,0,0,0,0,0,0,0,0,0,0,0,0,0,0,0,0,0,0,0,0,0,0,0,0,0,0,0,0,0,0,0,0,0,0,0,0,0,null,0,0,0,0,0,0,0,0,"-",0,"-"]
[null,null,null,0,{"$f":"IF(ISNA(VLOOKUP($B31,Round1Results,6,FALSE)),0,VLOOKUP($B31,Round1Results,6,FALSE)-F31)","v":0},0,{"$f":"SUM(E31:F31)","v":0},0,0,0,{"$f":"IF(ISNA(VLOOKUP($B31,Round2Results,6,FALSE)),0,VLOOKUP($B31,Round2Results,6,FALSE)-L31)","v":0},0,{"$f":"SUM(K31:L31)","v":0},{"$f":"G31+M31","v":0},0,0,{"$f":"IF(H31=0,0,H31-P31)","v":0},0,0,{"$f":"IF(I31=0,0,I31-S31)","v":0},0,{"$f":"IF(ISNA(VLOOKUP($B31,Round3Results,6,FALSE)),0,VLOOKUP($B31,Round3Results,6,FALSE)-W31)","v":0},0,{"$f":"SUM(V31:W31)","v":0},{"$f":"N31+X31","v":0},0,0,{"$f":"IF(P31=0,0,P31-AA31)","v":0},0,0,{"$f":"IF(S31=0,0,S31-AD31)","v":0},0,{"$f":"IF(ISNA(VLOOKUP($B31,Round4Results,6,FALSE)),0,VLOOKUP($B31,Round4Results,6,FALSE)-AH31)","v":0},0,{"$f":"SUM(AG31:AH31)","v":0},{"$f":"Y31+AI31","v":0},0,0,{"$f":"IF(AA31=0,0,AA31-AL31)","v":0},0,0,{"$f":"IF(AD31=0,0,AD31-AO31)","v":0},0,{"$f":"IF(ISNA(VLOOKUP($B31,Round5Results,6,FALSE)),0,VLOOKUP($B31,Round5Results,6,FALSE)-AS31)","v":0},0,{"$f":"SUM(AR31:AS31)","v":0},{"$f":"AJ31+AT31","v":0},0,0,{"$f":"IF(AL31=0,0,AL31-AW31)","v":0},0,0,{"$f":"IF(AO31=0,0,AO31-AZ31)","v":0},0,{"$f":"IF(ISNA(VLOOKUP($B31,Round6Results,6,FALSE)),0,VLOOKUP($B31,Round6Results,6,FALSE)-BD31)","v":0},0,{"$f":"SUM(BC31:BD31)","v":0},{"$f":"AU31+BE31","v":0},0,0,{"$f":"IF(AW31=0,0,AW31-BH31)","v":0},0,0,{"$f":"IF(AZ31=0,0,AZ31-BK31)","v":0},{"$f":"COUNTIF(D31,\">0\")+COUNTIF(J31,\">0\")+COUNTIF(U31,\">0\")+COUNTIF(AF31,\">0\")+COUNTIF(AQ31,\">0\")+COUNTIF(BB31,\">0\")","v":0},{"$f":"E31+K31+V31+AG31+AR31+BC31","v":0},0,{"$f":"D31+J31+U31+AF31+AQ31+BB31","v":0},null,{"$f":"IF($BQ$9=1,E31,IF($BQ31=2,K31,IF($BQ31=3,V31,IF($BQ31=4,AG31,IF($BQ31=5,AR31,IF($BQ31=6,BC31,0))))))","v":0},0,{"$f":"IF($BQ$9=1,D31,IF($BQ31=2,J31,IF($BQ31=3,U31,IF($BQ31=4,AF31,IF($BQ31=5,AP31,IF($BQ31=6,BB31,0))))))","v":0},{"$f":"E31+K31+V31+AG31+AR31+BC31-BR31","v":0},0,{"$f":"BU31+BV31","v":0},{"$f":"D31+J31+U31+AF31+AQ31+BB31-BT31","v":0},0,{"$f":"IF(AND(B31<>\"\",RoundsRun>1),IF(IF(RoundsRun=2,VLOOKUP(B31,SeriesSummary,Round2ClassRankChange,FALSE),IF(RoundsRun=3,VLOOKUP(B31,SeriesSummary,Round3ClassRankChange,FALSE),IF(RoundsRun=4,VLOOKUP(B31,SeriesSummary,Round4ClassRankChange,FALSE),IF(RoundsRun=5,VLOOKUP(B31,SeriesSummary,Round5ClassRankChange,FALSE),IF(RoundsRun=6,VLOOKUP(B31,SeriesSummary,Round6ClassRankChange,FALSE),\"-\")))))>0,\"+\"&IF(RoundsRun=2,VLOOKUP(B31,SeriesSummary,Round2ClassRankChange,FALSE),IF(RoundsRun=3,VLOOKUP(B31,SeriesSummary,Round3ClassRankChange,FALSE),IF(RoundsRun=4,VLOOKUP(B31,SeriesSummary,Round4ClassRankChange,FALSE),IF(RoundsRun=5,VLOOKUP(B31,SeriesSummary,Round5ClassRankChange,FALSE),IF(RoundsRun=6,VLOOKUP(B31,SeriesSummary,Round6ClassRankChange,FALSE),\"-\"))))),IF((IF(RoundsRun=2,VLOOKUP(B31,SeriesSummary,Round2ClassRankChange,FALSE),IF(RoundsRun=3,VLOOKUP(B31,SeriesSummary,Round3ClassRankChange,FALSE),IF(RoundsRun=4,VLOOKUP(B31,SeriesSummary,Round4ClassRankChange,FALSE),IF(RoundsRun=5,VLOOKUP(B31,SeriesSummary,Round5ClassRankChange,FALSE),IF(RoundsRun=6,VLOOKUP(B31,SeriesSummary,Round6ClassRankChange,FALSE),\"-\"))))))=0,\"-\",(IF(RoundsRun=2,VLOOKUP(B31,SeriesSummary,Round2ClassRankChange,FALSE),IF(RoundsRun=3,VLOOKUP(B31,SeriesSummary,Round3ClassRankChange,FALSE),IF(RoundsRun=4,VLOOKUP(B31,SeriesSummary,Round4ClassRankChange,FALSE),IF(RoundsRun=5,VLOOKUP(B31,SeriesSummary,Round5ClassRankChange,FALSE),IF(RoundsRun=6,VLOOKUP(B31,SeriesSummary,Round6ClassRankChange,FALSE),\"-\")))))))),\"-\")","v":"-"},{"$f":"IF(BM31>0,RANK(BW31,Total_Point_Range)+SUMPRODUCT((Total_Point_Range=BW31)*(Total_Lap_Range>BX31)),0)","v":0},{"$f":"IF(AND(B31<>\"\",RoundsRun>1),IF(IF(RoundsRun=2,VLOOKUP(B31,SeriesSummary,Round2RankChange,FALSE),IF(RoundsRun=3,VLOOKUP(B31,SeriesSummary,Round3RankChange,FALSE),IF(RoundsRun=4,VLOOKUP(B31,SeriesSummary,Round4RankChange,FALSE),IF(RoundsRun=5,VLOOKUP(B31,SeriesSummary,Round5RankChange,FALSE),IF(RoundsRun=6,VLOOKUP(B31,SeriesSummary,Round6RankChange,FALSE),\"-\")))))>0,\"+\"&IF(RoundsRun=2,VLOOKUP(B31,SeriesSummary,Round2RankChange,FALSE),IF(RoundsRun=3,VLOOKUP(B31,SeriesSummary,Round3RankChange,FALSE),IF(RoundsRun=4,VLOOKUP(B31,SeriesSummary,Round4RankChange,FALSE),IF(RoundsRun=5,VLOOKUP(B31,SeriesSummary,Round5RankChange,FALSE),IF(RoundsRun=6,VLOOKUP(B31,SeriesSummary,Round6RankChange,FALSE),\"-\"))))),IF((IF(RoundsRun=2,VLOOKUP(B31,SeriesSummary,Round2RankChange,FALSE),IF(RoundsRun=3,VLOOKUP(B31,SeriesSummary,Round3RankChange,FALSE),IF(RoundsRun=4,VLOOKUP(B31,SeriesSummary,Round4RankChange,FALSE),IF(RoundsRun=5,VLOOKUP(B31,SeriesSummary,Round5RankChange,FALSE),IF(RoundsRun=6,VLOOKUP(B31,SeriesSummary,Round6RankChange,FALSE),\"-\"))))))=0,\"-\",(IF(RoundsRun=2,VLOOKUP(B31,SeriesSummary,Round2RankChange,FALSE),IF(RoundsRun=3,VLOOKUP(B31,SeriesSummary,Round3RankChange,FALSE),IF(RoundsRun=4,VLOOKUP(B31,SeriesSummary,Round4RankChange,FALSE),IF(RoundsRun=5,VLOOKUP(B31,SeriesSummary,Round5RankChange,FALSE),IF(RoundsRun=6,VLOOKUP(B31,SeriesSummary,Round6RankChange,FALSE),\"-\")))))))),\"-\")","v":"-"}]
[null,null,null,0,0,0,0,0,0,0,0,0,0,0,0,0,0,0,0,0,0,0,0,0,0,0,0,0,0,0,0,0,0,0,0,0,0,0,0,0,0,0,0,0,0,0,0,0,0,0,0,0,0,0,0,0,0,0,0,0,0,0,0,0,0,0,0,0,null,0,0,0,0,0,0,0,0,"-",0,"-"]
[null,null,null,0,0,0,0,0,0,0,0,0,0,0,0,0,0,0,0,0,0,0,0,0,0,0,0,0,0,0,0,0,0,0,0,0,0,0,0,0,0,0,0,0,0,0,0,0,0,0,0,0,0,0,0,0,0,0,0,0,0,0,0,0,0,0,0,0,null,0,0,0,0,0,0,0,0,"-",0,"-"]
[null,null,null,0,0,0,0,0,0,0,0,0,0,0,0,0,0,0,0,0,0,0,0,0,0,0,0,0,0,0,0,0,0,0,0,0,0,0,0,0,0,0,0,0,0,0,0,0,0,0,0,0,0,0,0,0,0,0,0,0,0,0,0,0,0,0,0,0,null,0,0,0,0,0,0,0,0,"-",0,"-"]
[null,null,null,0,0,0,0,0,0,0,0,0,0,0,0,0,0,0,0,0,0,0,0,0,0,0,0,0,0,0,0,0,0,0,0,0,0,0,0,0,0,0,0,0,0,0,0,0,0,0,0,0,0,0,0,0,0,0,0,0,0,0,0,0,0,0,0,0,null,0,0,0,0,0,0,0,0,"-",0,"-"]
[null,null,null,0,0,0,{"$f":"SUM(E36:F36)","v":0},0,0,0,0,0,0,0,0,0,0,0,0,0,0,0,0,{"$f":"SUM(V36:W36)","v":0},0,0,0,0,0,0,0,0,0,0,{"$f":"SUM(AG36:AH36)","v":0},0,0,0,0,0,0,0,0,0,0,{"$f":"SUM(AR36:AS36)","v":0},0,0,0,0,0,0,0,0,0,0,{"$f":"SUM(BC36:BD36)","v":0},0,0,0,0,0,0,0,0,0,0,0,null,0,0,0,0,0,0,0,0,"-",0,"-"]
[null,null,null,0,0,0,0,0,0,0,0,0,0,0,0,0,0,0,0,0,0,0,0,0,0,0,0,0,0,0,0,0,0,0,0,0,0,0,0,0,0,0,0,0,0,0,0,0,0,0,0,0,0,0,0,0,0,0,0,0,0,0,0,0,0,0,0,0,null,0,0,0,0,0,0,0,0,"-",0,"-"]
[]
[]
[null,"Series Name","2016 Group C / IMSA"]
[null,"Rounds Run",{"$f":"COUNT('Round 1'!B4,'Round 2'!B4,'Round 3'!B4,'Round 4'!B4,'Round 5'!B4,'Round 6'!B4)","v":1}]
[null,"Points Table"]
[null,"Position","Points"]
[null,1,20]
[null,2,19]
[null,3,18]
[null,4,17]
[null,5,16]
[null,6,15]
[null,7,14]
[null,8,13]
[null,9,12]
[null,10,11]
[null,11,10]
[null,12,9]
[null,13,8]
[null,14,7]
[null,15,6]
[null,16,5]
[null,17,4]
[null,18,3]
[null,19,2]
[null,20,1]