{"text_format":"1","workbook":"xlsx","n_sheets":8,"sheets":["Leader Board","Round 1","Round 2","Round 3","Round 4","Round 5","Round 6","SumSheet"],"not_rendered":{"charts":0,"images":0,"macros":1,"external_links":0,"defined_names":51,"comments":1,"pivot_tables":0},"unopened":[],"bounds":{"document_bytes":16777216,"sheet_cells":100000,"rows_first":2000,"rows_last":500,"rows_between":2000,"halvings":0,"cell_chars":16384,"cell_head_chars":4096},"cells_cut":0,"cells_raw":0,"read":"whole","date_system":"1904"}

{"sheet":"Leader Board","index":0,"n_rows":31,"n_cols":40,"rows_kept":31,"cut":false,"hidden":false,"merged":[[4,20,4,27],[4,39,4,46],[4,1,4,9],[4,29,4,37],[4,11,4,18]]}
[]
[]
[]
[null,null,null,null,null,null,null,null,null,null,null,null,null,null,null,null,null,null,null,null,null,null,null,null,null,null,null,null,null,"Used to reformat the leader board after resorting the results. DO NOT MODIFY",null,null,null,null,null,null,null,null,null,"Used to reformat the Group A and B leader boards after resorting the results. DO NOT MODIFY"]
[null,{"$f":" SeriesName & \" - Round \" & RoundsRun & \" of 6  (Overall)\"","v":"Can Am 2014 - Round 5 of 6  (Overall)"},null,null,null,null,null,null,null,null,null,{"$f":" SeriesName & \" - Round \" & RoundsRun & \" of 6 (Group A)\"","v":"Can Am 2014 - Round 5 of 6 (Group A)"},null,null,null,null,null,null,null,null,{"$f":" SeriesName & \" - Round \" & RoundsRun & \" of 6 (Group B)\"","v":"Can Am 2014 - Round 5 of 6 (Group B)"}]
[null,"Position","+/-","Driver","Grp","Points","Behind","Starts","Laps","Fastest Laps",null,"Position","+/-","Driver","Points","Behind","Starts","Laps","Fastest Laps",null,"Position","+/-","Driver","Points","Behind","Starts","Laps","Fastest Laps"]
[null,{"$f":"IF(ISNA(VLOOKUP($D7,SeriesSummary,Rank,FALSE)),\"\",VLOOKUP($D7,SeriesSummary,Rank,FALSE))","v":1},{"$f":"IF(ISNA(VLOOKUP($D7,SeriesSummary,ChangeInRank,FALSE)),\"\",VLOOKUP($D7,SeriesSummary,ChangeInRank,FALSE))","v":"-"},{"$f":"IF(SumSheet!BM13>0,SumSheet!B13,\"\")","v":"Russell M."},{"$f":"IF(SumSheet!BM13>0,SumSheet!C13,\"\")","v":"A"},{"$f":"IF(D7<>\"\",IF(ISNA(VLOOKUP($D7,SeriesSummary,TotalPoints,FALSE)),\"-\",VLOOKUP($D7,SeriesSummary,TotalPoints,FALSE)),\"\")","v":101},"Leader",{"$f":"IF(ISNA(VLOOKUP($D7,SeriesSummary,Starts,FALSE)),\"\",VLOOKUP($D7,SeriesSummary,Starts,FALSE))","v":5},{"$f":"IF(ISNA(VLOOKUP($D7,SeriesSummary,TotalLaps,FALSE)),\"\",VLOOKUP($D7,SeriesSummary,TotalLaps,FALSE))","v":1105.55},{"$f":"IF(ISNA(VLOOKUP($D7,SeriesSummary,FastestLaps,FALSE)),\"\",VLOOKUP($D7,SeriesSummary,FastestLaps,FALSE))","v":3},null,{"$f":"IF(ISNA(VLOOKUP($N7,SeriesSummary,ClassRank,FALSE)),\"\",VLOOKUP($N7,SeriesSummary,ClassRank,FALSE))","v":1},{"$f":"IF(ISNA(VLOOKUP($N7,SeriesSummary,ChangeInClassRank,FALSE)),\"\",VLOOKUP($N7,SeriesSummary,ChangeInClassRank,FALSE))","v":"-"},{"$f":"IF(AND(SumSheet!BM13>0,SumSheet!C13=\"A\"),SumSheet!B13,\"\")","v":"Russell M."},{"$f":"IF(N7<>\"\",IF(ISNA(VLOOKUP($N7,SeriesSummary,TotalPoints,FALSE)),\"-\",VLOOKUP($N7,SeriesSummary,TotalPoints,FALSE)),\"\")","v":101},"Leader",{"$f":"IF(ISNA(VLOOKUP($N7,SeriesSummary,Starts,FALSE)),\"\",VLOOKUP($N7,SeriesSummary,Starts,FALSE))","v":5},{"$f":"IF(ISNA(VLOOKUP($N7,SeriesSummary,TotalLaps,FALSE)),\"\",VLOOKUP($N7,SeriesSummary,TotalLaps,FALSE))","v":1105.55},{"$f":"IF(ISNA(VLOOKUP($N7,SeriesSummary,FastestLaps,FALSE)),\"\",VLOOKUP($N7,SeriesSummary,FastestLaps,FALSE))","v":3},null,{"$f":"IF(ISNA(VLOOKUP($W7,SeriesSummary,ClassRank,FALSE)),\"\",VLOOKUP($W7,SeriesSummary,ClassRank,FALSE))","v":1},{"$f":"IF(ISNA(VLOOKUP($W7,SeriesSummary,ChangeInClassRank,FALSE)),\"\",VLOOKUP($W7,SeriesSummary,ChangeInClassRank,FALSE))","v":"-"},{"$f":"IF(AND(SumSheet!BM9>0,SumSheet!C9=\"B\"),SumSheet!B9,\"\")","v":"Jordan C."},{"$f":"IF(W7<>\"\",IF(ISNA(VLOOKUP($W7,SeriesSummary,TotalPoints,FALSE)),\"-\",VLOOKUP($W7,SeriesSummary,TotalPoints,FALSE)),\"\")","v":87},"Leader",{"$f":"IF(ISNA(VLOOKUP($W7,SeriesSummary,Starts,FALSE)),\"\",VLOOKUP($W7,SeriesSummary,Starts,FALSE))","v":5},{"$f":"IF(ISNA(VLOOKUP($W7,SeriesSummary,TotalLaps,FALSE)),\"\",VLOOKUP($W7,SeriesSummary,TotalLaps,FALSE))","v":1048.97},{"$f":"IF(ISNA(VLOOKUP($W7,SeriesSummary,FastestLaps,FALSE)),\"\",VLOOKUP($W7,SeriesSummary,FastestLaps,FALSE))","v":4}]
[null,{"$f":"IF(ISNA(VLOOKUP($D8,SeriesSummary,Rank,FALSE)),\"\",VLOOKUP($D8,SeriesSummary,Rank,FALSE))","v":2},{"$f":"IF(ISNA(VLOOKUP($D8,SeriesSummary,ChangeInRank,FALSE)),\"\",VLOOKUP($D8,SeriesSummary,ChangeInRank,FALSE))","v":"-"},{"$f":"IF(SumSheet!BM9>0,SumSheet!B9,\"\")","v":"Jordan C."},{"$f":"IF(SumSheet!BM9>0,SumSheet!C9,\"\")","v":"B"},87,{"$f":"IF(ISERROR(F8-$F$7),\"\",F8-$F$7)","v":-14},5,1048.97,4,null,{"$f":"IF(ISNA(VLOOKUP($N8,SeriesSummary,ClassRank,FALSE)),\"\",VLOOKUP($N8,SeriesSummary,ClassRank,FALSE))","v":2},{"$f":"IF(ISNA(VLOOKUP($N8,SeriesSummary,ChangeInClassRank,FALSE)),\"\",VLOOKUP($N8,SeriesSummary,ChangeInClassRank,FALSE))","v":"-"},{"$f":"IF(AND(SumSheet!BM15>0,SumSheet!C15=\"A\"),SumSheet!B15,\"\")","v":"Stephen B."},81,{"$f":"IF(ISERROR(O8-$O$7),\"\",O8-$O$7)","v":-20},5,1057.22,0,null,{"$f":"IF(ISNA(VLOOKUP($W8,SeriesSummary,ClassRank,FALSE)),\"\",VLOOKUP($W8,SeriesSummary,ClassRank,FALSE))","v":2},{"$f":"IF(ISNA(VLOOKUP($W8,SeriesSummary,ChangeInClassRank,FALSE)),\"\",VLOOKUP($W8,SeriesSummary,ChangeInClassRank,FALSE))","v":"-"},{"$f":"IF(AND(SumSheet!BM16>0,SumSheet!C16=\"B\"),SumSheet!B16,\"\")","v":"David C."},69,{"$f":"IF(ISERROR(X8-$X$7),\"\",X8-$X$7)","v":-18},5,932.1400000000001,0]
[null,{"$f":"IF(ISNA(VLOOKUP($D9,SeriesSummary,Rank,FALSE)),\"\",VLOOKUP($D9,SeriesSummary,Rank,FALSE))","v":3},{"$f":"IF(ISNA(VLOOKUP($D9,SeriesSummary,ChangeInRank,FALSE)),\"\",VLOOKUP($D9,SeriesSummary,ChangeInRank,FALSE))","v":"-"},{"$f":"IF(SumSheet!BM15>0,SumSheet!B15,\"\")","v":"Stephen B."},{"$f":"IF(SumSheet!BM15>0,SumSheet!C15,\"\")","v":"A"},81,{"$f":"IF(ISERROR(F9-$F$7),\"\",F9-$F$7)","v":-20},5,1057.22,0,null,{"$f":"IF(ISNA(VLOOKUP($N9,SeriesSummary,ClassRank,FALSE)),\"\",VLOOKUP($N9,SeriesSummary,ClassRank,FALSE))","v":3},{"$f":"IF(ISNA(VLOOKUP($N9,SeriesSummary,ChangeInClassRank,FALSE)),\"\",VLOOKUP($N9,SeriesSummary,ChangeInClassRank,FALSE))","v":"+1"},{"$f":"IF(AND(SumSheet!BM12>0,SumSheet!C12=\"A\"),SumSheet!B12,\"\")","v":"Roy M."},73,{"$f":"IF(ISERROR(O9-$O$7),\"\",O9-$O$7)","v":-28},4,867.33,0,null,{"$f":"IF(ISNA(VLOOKUP($W9,SeriesSummary,ClassRank,FALSE)),\"\",VLOOKUP($W9,SeriesSummary,ClassRank,FALSE))","v":3},{"$f":"IF(ISNA(VLOOKUP($W9,SeriesSummary,ChangeInClassRank,FALSE)),\"\",VLOOKUP($W9,SeriesSummary,ChangeInClassRank,FALSE))","v":"-"},{"$f":"IF(AND(SumSheet!BM18>0,SumSheet!C18=\"B\"),SumSheet!B18,\"\")","v":"Mark L."},63,{"$f":"IF(ISERROR(X9-$X$7),\"\",X9-$X$7)","v":-24},5,895.57,0]
[null,{"$f":"IF(ISNA(VLOOKUP($D10,SeriesSummary,Rank,FALSE)),\"\",VLOOKUP($D10,SeriesSummary,Rank,FALSE))","v":4},{"$f":"IF(ISNA(VLOOKUP($D10,SeriesSummary,ChangeInRank,FALSE)),\"\",VLOOKUP($D10,SeriesSummary,ChangeInRank,FALSE))","v":"+2"},{"$f":"IF(SumSheet!BM12>0,SumSheet!B12,\"\")","v":"Roy M."},{"$f":"IF(SumSheet!BM12>0,SumSheet!C12,\"\")","v":"A"},73,-28,4,867.33,0,null,{"$f":"IF(ISNA(VLOOKUP($N10,SeriesSummary,ClassRank,FALSE)),\"\",VLOOKUP($N10,SeriesSummary,ClassRank,FALSE))","v":4},{"$f":"IF(ISNA(VLOOKUP($N10,SeriesSummary,ChangeInClassRank,FALSE)),\"\",VLOOKUP($N10,SeriesSummary,ChangeInClassRank,FALSE))","v":-1},{"$f":"IF(AND(SumSheet!BM10>0,SumSheet!C10=\"A\"),SumSheet!B10,\"\")","v":"Marty M."},58,-43,3,658.95,1,null,{"$f":"IF(ISNA(VLOOKUP($W10,SeriesSummary,ClassRank,FALSE)),\"\",VLOOKUP($W10,SeriesSummary,ClassRank,FALSE))","v":4},{"$f":"IF(ISNA(VLOOKUP($W10,SeriesSummary,ChangeInClassRank,FALSE)),\"\",VLOOKUP($W10,SeriesSummary,ChangeInClassRank,FALSE))","v":"-"},{"$f":"IF(AND(SumSheet!BM11>0,SumSheet!C11=\"B\"),SumSheet!B11,\"\")","v":"Rich C."},57,-30,4,780.43999999999994,0]
[null,{"$f":"IF(ISNA(VLOOKUP($D11,SeriesSummary,Rank,FALSE)),\"\",VLOOKUP($D11,SeriesSummary,Rank,FALSE))","v":5},{"$f":"IF(ISNA(VLOOKUP($D11,SeriesSummary,ChangeInRank,FALSE)),\"\",VLOOKUP($D11,SeriesSummary,ChangeInRank,FALSE))","v":"-"},{"$f":"IF(SumSheet!BM16>0,SumSheet!B16,\"\")","v":"David C."},{"$f":"IF(SumSheet!BM16>0,SumSheet!C16,\"\")","v":"B"},69,-32,5,932.1400000000001,0,null,{"$f":"IF(ISNA(VLOOKUP($N11,SeriesSummary,ClassRank,FALSE)),\"\",VLOOKUP($N11,SeriesSummary,ClassRank,FALSE))","v":5},{"$f":"IF(ISNA(VLOOKUP($N11,SeriesSummary,ChangeInClassRank,FALSE)),\"\",VLOOKUP($N11,SeriesSummary,ChangeInClassRank,FALSE))","v":"-"},{"$f":"IF(AND(SumSheet!BM4>0,SumSheet!C4=\"A\"),SumSheet!B4,\"\")","v":"Ary B."},48,-53,3,589.43000000000006,1,null,{"$f":"IF(ISNA(VLOOKUP($W11,SeriesSummary,ClassRank,FALSE)),\"\",VLOOKUP($W11,SeriesSummary,ClassRank,FALSE))","v":5},{"$f":"IF(ISNA(VLOOKUP($W11,SeriesSummary,ChangeInClassRank,FALSE)),\"\",VLOOKUP($W11,SeriesSummary,ChangeInClassRank,FALSE))","v":"-"},{"$f":"IF(AND(SumSheet!BM5>0,SumSheet!C5=\"B\"),SumSheet!B5,\"\")","v":"Austin C."},31,-56,2,395.2,1]
[null,{"$f":"IF(ISNA(VLOOKUP($D12,SeriesSummary,Rank,FALSE)),\"\",VLOOKUP($D12,SeriesSummary,Rank,FALSE))","v":6},{"$f":"IF(ISNA(VLOOKUP($D12,SeriesSummary,ChangeInRank,FALSE)),\"\",VLOOKUP($D12,SeriesSummary,ChangeInRank,FALSE))","v":"+1"},{"$f":"IF(SumSheet!BM18>0,SumSheet!B18,\"\")","v":"Mark L."},{"$f":"IF(SumSheet!BM18>0,SumSheet!C18,\"\")","v":"B"},63,-38,5,895.57,0,null,{"$f":"IF(ISNA(VLOOKUP($N12,SeriesSummary,ClassRank,FALSE)),\"\",VLOOKUP($N12,SeriesSummary,ClassRank,FALSE))","v":6},{"$f":"IF(ISNA(VLOOKUP($N12,SeriesSummary,ChangeInClassRank,FALSE)),\"\",VLOOKUP($N12,SeriesSummary,ChangeInClassRank,FALSE))","v":"-"},{"$f":"IF(AND(SumSheet!BM14>0,SumSheet!C14=\"A\"),SumSheet!B14,\"\")","v":"Shawn G."},34,-67,2,428.21000000000004,0,null,{"$f":"IF(ISNA(VLOOKUP($W12,SeriesSummary,ClassRank,FALSE)),\"\",VLOOKUP($W12,SeriesSummary,ClassRank,FALSE))","v":""},{"$f":"IF(ISNA(VLOOKUP($W12,SeriesSummary,ChangeInClassRank,FALSE)),\"\",VLOOKUP($W12,SeriesSummary,ChangeInClassRank,FALSE))","v":""},{"$f":"IF(AND(SumSheet!BM4>0,SumSheet!C4=\"B\"),SumSheet!B4,\"\")","v":""},"","","","",""]
[null,{"$f":"IF(ISNA(VLOOKUP($D13,SeriesSummary,Rank,FALSE)),\"\",VLOOKUP($D13,SeriesSummary,Rank,FALSE))","v":7},{"$f":"IF(ISNA(VLOOKUP($D13,SeriesSummary,ChangeInRank,FALSE)),\"\",VLOOKUP($D13,SeriesSummary,ChangeInRank,FALSE))","v":-3},{"$f":"IF(SumSheet!BM10>0,SumSheet!B10,\"\")","v":"Marty M."},{"$f":"IF(SumSheet!BM10>0,SumSheet!C10,\"\")","v":"A"},58,-43,3,658.95,1,null,{"$f":"IF(ISNA(VLOOKUP($N13,SeriesSummary,ClassRank,FALSE)),\"\",VLOOKUP($N13,SeriesSummary,ClassRank,FALSE))","v":""},{"$f":"IF(ISNA(VLOOKUP($N13,SeriesSummary,ChangeInClassRank,FALSE)),\"\",VLOOKUP($N13,SeriesSummary,ChangeInClassRank,FALSE))","v":""},{"$f":"IF(AND(SumSheet!BM5>0,SumSheet!C5=\"A\"),SumSheet!B5,\"\")","v":""},"","","","","",null,{"$f":"IF(ISNA(VLOOKUP($W13,SeriesSummary,ClassRank,FALSE)),\"\",VLOOKUP($W13,SeriesSummary,ClassRank,FALSE))","v":""},{"$f":"IF(ISNA(VLOOKUP($W13,SeriesSummary,ChangeInClassRank,FALSE)),\"\",VLOOKUP($W13,SeriesSummary,ChangeInClassRank,FALSE))","v":""},{"$f":"IF(AND(SumSheet!BM6>0,SumSheet!C6=\"B\"),SumSheet!B6,\"\")","v":""},"","","","",""]
[null,{"$f":"IF(ISNA(VLOOKUP($D14,SeriesSummary,Rank,FALSE)),\"\",VLOOKUP($D14,SeriesSummary,Rank,FALSE))","v":8},{"$f":"IF(ISNA(VLOOKUP($D14,SeriesSummary,ChangeInRank,FALSE)),\"\",VLOOKUP($D14,SeriesSummary,ChangeInRank,FALSE))","v":"-"},{"$f":"IF(SumSheet!BM11>0,SumSheet!B11,\"\")","v":"Rich C."},{"$f":"IF(SumSheet!BM11>0,SumSheet!C11,\"\")","v":"B"},57,-44,4,780.43999999999994,0,null,{"$f":"IF(ISNA(VLOOKUP($N14,SeriesSummary,ClassRank,FALSE)),\"\",VLOOKUP($N14,SeriesSummary,ClassRank,FALSE))","v":""},{"$f":"IF(ISNA(VLOOKUP($N14,SeriesSummary,ChangeInClassRank,FALSE)),\"\",VLOOKUP($N14,SeriesSummary,ChangeInClassRank,FALSE))","v":""},{"$f":"IF(AND(SumSheet!BM6>0,SumSheet!C6=\"A\"),SumSheet!B6,\"\")","v":""},"","","","","",null,{"$f":"IF(ISNA(VLOOKUP($W14,SeriesSummary,ClassRank,FALSE)),\"\",VLOOKUP($W14,SeriesSummary,ClassRank,FALSE))","v":""},{"$f":"IF(ISNA(VLOOKUP($W14,SeriesSummary,ChangeInClassRank,FALSE)),\"\",VLOOKUP($W14,SeriesSummary,ChangeInClassRank,FALSE))","v":""},{"$f":"IF(AND(SumSheet!BM7>0,SumSheet!C7=\"B\"),SumSheet!B7,\"\")","v":""},"","","","",""]
[null,{"$f":"IF(ISNA(VLOOKUP($D15,SeriesSummary,Rank,FALSE)),\"\",VLOOKUP($D15,SeriesSummary,Rank,FALSE))","v":9},{"$f":"IF(ISNA(VLOOKUP($D15,SeriesSummary,ChangeInRank,FALSE)),\"\",VLOOKUP($D15,SeriesSummary,ChangeInRank,FALSE))","v":"-"},{"$f":"IF(SumSheet!BM4>0,SumSheet!B4,\"\")","v":"Ary B."},{"$f":"IF(SumSheet!BM4>0,SumSheet!C4,\"\")","v":"A"},48,-53,3,589.43000000000006,1,null,{"$f":"IF(ISNA(VLOOKUP($N15,SeriesSummary,ClassRank,FALSE)),\"\",VLOOKUP($N15,SeriesSummary,ClassRank,FALSE))","v":""},{"$f":"IF(ISNA(VLOOKUP($N15,SeriesSummary,ChangeInClassRank,FALSE)),\"\",VLOOKUP($N15,SeriesSummary,ChangeInClassRank,FALSE))","v":""},{"$f":"IF(AND(SumSheet!BM7>0,SumSheet!C7=\"A\"),SumSheet!B7,\"\")","v":""},"","","","","",null,{"$f":"IF(ISNA(VLOOKUP($W15,SeriesSummary,ClassRank,FALSE)),\"\",VLOOKUP($W15,SeriesSummary,ClassRank,FALSE))","v":""},{"$f":"IF(ISNA(VLOOKUP($W15,SeriesSummary,ChangeInClassRank,FALSE)),\"\",VLOOKUP($W15,SeriesSummary,ChangeInClassRank,FALSE))","v":""},{"$f":"IF(AND(SumSheet!BM8>0,SumSheet!C8=\"B\"),SumSheet!B8,\"\")","v":""},"","","","",""]
[null,{"$f":"IF(ISNA(VLOOKUP($D16,SeriesSummary,Rank,FALSE)),\"\",VLOOKUP($D16,SeriesSummary,Rank,FALSE))","v":10},{"$f":"IF(ISNA(VLOOKUP($D16,SeriesSummary,ChangeInRank,FALSE)),\"\",VLOOKUP($D16,SeriesSummary,ChangeInRank,FALSE))","v":"-"},{"$f":"IF(SumSheet!BM14>0,SumSheet!B14,\"\")","v":"Shawn G."},{"$f":"IF(SumSheet!BM14>0,SumSheet!C14,\"\")","v":"A"},34,-67,2,428.21000000000004,0,null,{"$f":"IF(ISNA(VLOOKUP($N16,SeriesSummary,ClassRank,FALSE)),\"\",VLOOKUP($N16,SeriesSummary,ClassRank,FALSE))","v":""},{"$f":"IF(ISNA(VLOOKUP($N16,SeriesSummary,ChangeInClassRank,FALSE)),\"\",VLOOKUP($N16,SeriesSummary,ChangeInClassRank,FALSE))","v":""},{"$f":"IF(AND(SumSheet!BM8>0,SumSheet!C8=\"A\"),SumSheet!B8,\"\")","v":""},"","","","","",null,{"$f":"IF(ISNA(VLOOKUP($W16,SeriesSummary,ClassRank,FALSE)),\"\",VLOOKUP($W16,SeriesSummary,ClassRank,FALSE))","v":""},{"$f":"IF(ISNA(VLOOKUP($W16,SeriesSummary,ChangeInClassRank,FALSE)),\"\",VLOOKUP($W16,SeriesSummary,ChangeInClassRank,FALSE))","v":""},{"$f":"IF(AND(SumSheet!BM10>0,SumSheet!C10=\"B\"),SumSheet!B10,\"\")","v":""},"","","","",""]
[null,{"$f":"IF(ISNA(VLOOKUP($D17,SeriesSummary,Rank,FALSE)),\"\",VLOOKUP($D17,SeriesSummary,Rank,FALSE))","v":11},{"$f":"IF(ISNA(VLOOKUP($D17,SeriesSummary,ChangeInRank,FALSE)),\"\",VLOOKUP($D17,SeriesSummary,ChangeInRank,FALSE))","v":-1},{"$f":"IF(SumSheet!BM5>0,SumSheet!B5,\"\")","v":"Austin C."},{"$f":"IF(SumSheet!BM5>0,SumSheet!C5,\"\")","v":"B"},31,-70,2,395.2,1,null,{"$f":"IF(ISNA(VLOOKUP($N17,SeriesSummary,ClassRank,FALSE)),\"\",VLOOKUP($N17,SeriesSummary,ClassRank,FALSE))","v":""},{"$f":"IF(ISNA(VLOOKUP($N17,SeriesSummary,ChangeInClassRank,FALSE)),\"\",VLOOKUP($N17,SeriesSummary,ChangeInClassRank,FALSE))","v":""},{"$f":"IF(AND(SumSheet!BM9>0,SumSheet!C9=\"A\"),SumSheet!B9,\"\")","v":""},"","","","","",null,{"$f":"IF(ISNA(VLOOKUP($W17,SeriesSummary,ClassRank,FALSE)),\"\",VLOOKUP($W17,SeriesSummary,ClassRank,FALSE))","v":""},{"$f":"IF(ISNA(VLOOKUP($W17,SeriesSummary,ChangeInClassRank,FALSE)),\"\",VLOOKUP($W17,SeriesSummary,ChangeInClassRank,FALSE))","v":""},{"$f":"IF(AND(SumSheet!BM12>0,SumSheet!C12=\"B\"),SumSheet!B12,\"\")","v":""},"","","","",""]
[null,{"$f":"IF(ISNA(VLOOKUP($D18,SeriesSummary,Rank,FALSE)),\"\",VLOOKUP($D18,SeriesSummary,Rank,FALSE))","v":""},{"$f":"IF(ISNA(VLOOKUP($D18,SeriesSummary,ChangeInRank,FALSE)),\"\",VLOOKUP($D18,SeriesSummary,ChangeInRank,FALSE))","v":""},{"$f":"IF(SumSheet!BM6>0,SumSheet!B6,\"\")","v":""},{"$f":"IF(SumSheet!BM6>0,SumSheet!C6,\"\")","v":""},"","","","","",null,{"$f":"IF(ISNA(VLOOKUP($N18,SeriesSummary,ClassRank,FALSE)),\"\",VLOOKUP($N18,SeriesSummary,ClassRank,FALSE))","v":""},{"$f":"IF(ISNA(VLOOKUP($N18,SeriesSummary,ChangeInClassRank,FALSE)),\"\",VLOOKUP($N18,SeriesSummary,ChangeInClassRank,FALSE))","v":""},{"$f":"IF(AND(SumSheet!BM11>0,SumSheet!C11=\"A\"),SumSheet!B11,\"\")","v":""},"","","","","",null,{"$f":"IF(ISNA(VLOOKUP($W18,SeriesSummary,ClassRank,FALSE)),\"\",VLOOKUP($W18,SeriesSummary,ClassRank,FALSE))","v":""},{"$f":"IF(ISNA(VLOOKUP($W18,SeriesSummary,ChangeInClassRank,FALSE)),\"\",VLOOKUP($W18,SeriesSummary,ChangeInClassRank,FALSE))","v":""},{"$f":"IF(AND(SumSheet!BM13>0,SumSheet!C13=\"B\"),SumSheet!B13,\"\")","v":""},"","","","",""]
[null,{"$f":"IF(ISNA(VLOOKUP($D19,SeriesSummary,Rank,FALSE)),\"\",VLOOKUP($D19,SeriesSummary,Rank,FALSE))","v":""},{"$f":"IF(ISNA(VLOOKUP($D19,SeriesSummary,ChangeInRank,FALSE)),\"\",VLOOKUP($D19,SeriesSummary,ChangeInRank,FALSE))","v":""},{"$f":"IF(SumSheet!BM7>0,SumSheet!B7,\"\")","v":""},{"$f":"IF(SumSheet!BM7>0,SumSheet!C7,\"\")","v":""},"","","","","",null,{"$f":"IF(ISNA(VLOOKUP($N19,SeriesSummary,ClassRank,FALSE)),\"\",VLOOKUP($N19,SeriesSummary,ClassRank,FALSE))","v":""},{"$f":"IF(ISNA(VLOOKUP($N19,SeriesSummary,ChangeInClassRank,FALSE)),\"\",VLOOKUP($N19,SeriesSummary,ChangeInClassRank,FALSE))","v":""},{"$f":"IF(AND(SumSheet!BM16>0,SumSheet!C16=\"A\"),SumSheet!B16,\"\")","v":""},"","","","","",null,{"$f":"IF(ISNA(VLOOKUP($W19,SeriesSummary,ClassRank,FALSE)),\"\",VLOOKUP($W19,SeriesSummary,ClassRank,FALSE))","v":""},{"$f":"IF(ISNA(VLOOKUP($W19,SeriesSummary,ChangeInClassRank,FALSE)),\"\",VLOOKUP($W19,SeriesSummary,ChangeInClassRank,FALSE))","v":""},{"$f":"IF(AND(SumSheet!BM14>0,SumSheet!C14=\"B\"),SumSheet!B14,\"\")","v":""},"","","","",""]
[null,{"$f":"IF(ISNA(VLOOKUP($D20,SeriesSummary,Rank,FALSE)),\"\",VLOOKUP($D20,SeriesSummary,Rank,FALSE))","v":""},{"$f":"IF(ISNA(VLOOKUP($D20,SeriesSummary,ChangeInRank,FALSE)),\"\",VLOOKUP($D20,SeriesSummary,ChangeInRank,FALSE))","v":""},{"$f":"IF(SumSheet!BM8>0,SumSheet!B8,\"\")","v":""},{"$f":"IF(SumSheet!BM8>0,SumSheet!C8,\"\")","v":""},"","","","","",null,{"$f":"IF(ISNA(VLOOKUP($N20,SeriesSummary,ClassRank,FALSE)),\"\",VLOOKUP($N20,SeriesSummary,ClassRank,FALSE))","v":""},{"$f":"IF(ISNA(VLOOKUP($N20,SeriesSummary,ChangeInClassRank,FALSE)),\"\",VLOOKUP($N20,SeriesSummary,ChangeInClassRank,FALSE))","v":""},{"$f":"IF(AND(SumSheet!BM17>0,SumSheet!C17=\"A\"),SumSheet!B17,\"\")","v":""},"","","","","",null,{"$f":"IF(ISNA(VLOOKUP($W20,SeriesSummary,ClassRank,FALSE)),\"\",VLOOKUP($W20,SeriesSummary,ClassRank,FALSE))","v":""},{"$f":"IF(ISNA(VLOOKUP($W20,SeriesSummary,ChangeInClassRank,FALSE)),\"\",VLOOKUP($W20,SeriesSummary,ChangeInClassRank,FALSE))","v":""},{"$f":"IF(AND(SumSheet!BM15>0,SumSheet!C15=\"B\"),SumSheet!B15,\"\")","v":""},"","","","",""]
[null,{"$f":"IF(ISNA(VLOOKUP($D21,SeriesSummary,Rank,FALSE)),\"\",VLOOKUP($D21,SeriesSummary,Rank,FALSE))","v":""},{"$f":"IF(ISNA(VLOOKUP($D21,SeriesSummary,ChangeInRank,FALSE)),\"\",VLOOKUP($D21,SeriesSummary,ChangeInRank,FALSE))","v":""},{"$f":"IF(SumSheet!BM17>0,SumSheet!B17,\"\")","v":""},{"$f":"IF(SumSheet!BM17>0,SumSheet!C17,\"\")","v":""},"","","","","",null,{"$f":"IF(ISNA(VLOOKUP($N21,SeriesSummary,ClassRank,FALSE)),\"\",VLOOKUP($N21,SeriesSummary,ClassRank,FALSE))","v":""},{"$f":"IF(ISNA(VLOOKUP($N21,SeriesSummary,ChangeInClassRank,FALSE)),\"\",VLOOKUP($N21,SeriesSummary,ChangeInClassRank,FALSE))","v":""},{"$f":"IF(AND(SumSheet!BM18>0,SumSheet!C18=\"A\"),SumSheet!B18,\"\")","v":""},"","","","","",null,{"$f":"IF(ISNA(VLOOKUP($W21,SeriesSummary,ClassRank,FALSE)),\"\",VLOOKUP($W21,SeriesSummary,ClassRank,FALSE))","v":""},{"$f":"IF(ISNA(VLOOKUP($W21,SeriesSummary,ChangeInClassRank,FALSE)),\"\",VLOOKUP($W21,SeriesSummary,ChangeInClassRank,FALSE))","v":""},{"$f":"IF(AND(SumSheet!BM17>0,SumSheet!C17=\"B\"),SumSheet!B17,\"\")","v":""},"","","","",""]
[null,{"$f":"IF(ISNA(VLOOKUP($D22,SeriesSummary,Rank,FALSE)),\"\",VLOOKUP($D22,SeriesSummary,Rank,FALSE))","v":""},{"$f":"IF(ISNA(VLOOKUP($D22,SeriesSummary,ChangeInRank,FALSE)),\"\",VLOOKUP($D22,SeriesSummary,ChangeInRank,FALSE))","v":""},{"$f":"IF(SumSheet!BM19>0,SumSheet!B19,\"\")","v":""},{"$f":"IF(SumSheet!BM19>0,SumSheet!C19,\"\")","v":""},"","","","","",null,{"$f":"IF(ISNA(VLOOKUP($N22,SeriesSummary,ClassRank,FALSE)),\"\",VLOOKUP($N22,SeriesSummary,ClassRank,FALSE))","v":""},{"$f":"IF(ISNA(VLOOKUP($N22,SeriesSummary,ChangeInClassRank,FALSE)),\"\",VLOOKUP($N22,SeriesSummary,ChangeInClassRank,FALSE))","v":""},{"$f":"IF(AND(SumSheet!BM19>0,SumSheet!C19=\"A\"),SumSheet!B19,\"\")","v":""},"","","","","",null,{"$f":"IF(ISNA(VLOOKUP($W22,SeriesSummary,ClassRank,FALSE)),\"\",VLOOKUP($W22,SeriesSummary,ClassRank,FALSE))","v":""},{"$f":"IF(ISNA(VLOOKUP($W22,SeriesSummary,ChangeInClassRank,FALSE)),\"\",VLOOKUP($W22,SeriesSummary,ChangeInClassRank,FALSE))","v":""},{"$f":"IF(AND(SumSheet!BM19>0,SumSheet!C19=\"B\"),SumSheet!B19,\"\")","v":""},"","","","",""]
[null,{"$f":"IF(ISNA(VLOOKUP($D23,SeriesSummary,Rank,FALSE)),\"\",VLOOKUP($D23,SeriesSummary,Rank,FALSE))","v":""},{"$f":"IF(ISNA(VLOOKUP($D23,SeriesSummary,ChangeInRank,FALSE)),\"\",VLOOKUP($D23,SeriesSummary,ChangeInRank,FALSE))","v":""},{"$f":"IF(SumSheet!BM20>0,SumSheet!B20,\"\")","v":""},{"$f":"IF(SumSheet!BM20>0,SumSheet!C20,\"\")","v":""},"","","","","",null,{"$f":"IF(ISNA(VLOOKUP($N23,SeriesSummary,ClassRank,FALSE)),\"\",VLOOKUP($N23,SeriesSummary,ClassRank,FALSE))","v":""},{"$f":"IF(ISNA(VLOOKUP($N23,SeriesSummary,ChangeInClassRank,FALSE)),\"\",VLOOKUP($N23,SeriesSummary,ChangeInClassRank,FALSE))","v":""},{"$f":"IF(AND(SumSheet!BM20>0,SumSheet!C20=\"A\"),SumSheet!B20,\"\")","v":""},"","","","","",null,{"$f":"IF(ISNA(VLOOKUP($W23,SeriesSummary,ClassRank,FALSE)),\"\",VLOOKUP($W23,SeriesSummary,ClassRank,FALSE))","v":""},{"$f":"IF(ISNA(VLOOKUP($W23,SeriesSummary,ChangeInClassRank,FALSE)),\"\",VLOOKUP($W23,SeriesSummary,ChangeInClassRank,FALSE))","v":""},{"$f":"IF(AND(SumSheet!BM20>0,SumSheet!C20=\"B\"),SumSheet!B20,\"\")","v":""},"","","","",""]
[null,{"$f":"IF(ISNA(VLOOKUP($D24,SeriesSummary,Rank,FALSE)),\"\",VLOOKUP($D24,SeriesSummary,Rank,FALSE))","v":""},{"$f":"IF(ISNA(VLOOKUP($D24,SeriesSummary,ChangeInRank,FALSE)),\"\",VLOOKUP($D24,SeriesSummary,ChangeInRank,FALSE))","v":""},{"$f":"IF(SumSheet!BM21>0,SumSheet!B21,\"\")","v":""},{"$f":"IF(SumSheet!BM21>0,SumSheet!C21,\"\")","v":""},"","","","","",null,{"$f":"IF(ISNA(VLOOKUP($N24,SeriesSummary,ClassRank,FALSE)),\"\",VLOOKUP($N24,SeriesSummary,ClassRank,FALSE))","v":""},{"$f":"IF(ISNA(VLOOKUP($N24,SeriesSummary,ChangeInClassRank,FALSE)),\"\",VLOOKUP($N24,SeriesSummary,ChangeInClassRank,FALSE))","v":""},{"$f":"IF(AND(SumSheet!BM21>0,SumSheet!C21=\"A\"),SumSheet!B21,\"\")","v":""},"","","","","",null,{"$f":"IF(ISNA(VLOOKUP($W24,SeriesSummary,ClassRank,FALSE)),\"\",VLOOKUP($W24,SeriesSummary,ClassRank,FALSE))","v":""},{"$f":"IF(ISNA(VLOOKUP($W24,SeriesSummary,ChangeInClassRank,FALSE)),\"\",VLOOKUP($W24,SeriesSummary,ChangeInClassRank,FALSE))","v":""},{"$f":"IF(AND(SumSheet!BM21>0,SumSheet!C21=\"B\"),SumSheet!B21,\"\")","v":""},"","","","",""]
[null,{"$f":"IF(ISNA(VLOOKUP($D25,SeriesSummary,Rank,FALSE)),\"\",VLOOKUP($D25,SeriesSummary,Rank,FALSE))","v":""},{"$f":"IF(ISNA(VLOOKUP($D25,SeriesSummary,ChangeInRank,FALSE)),\"\",VLOOKUP($D25,SeriesSummary,ChangeInRank,FALSE))","v":""},{"$f":"IF(SumSheet!BM22>0,SumSheet!B22,\"\")","v":""},{"$f":"IF(SumSheet!BM22>0,SumSheet!C22,\"\")","v":""},"","","","","",null,{"$f":"IF(ISNA(VLOOKUP($N25,SeriesSummary,ClassRank,FALSE)),\"\",VLOOKUP($N25,SeriesSummary,ClassRank,FALSE))","v":""},{"$f":"IF(ISNA(VLOOKUP($N25,SeriesSummary,ChangeInClassRank,FALSE)),\"\",VLOOKUP($N25,SeriesSummary,ChangeInClassRank,FALSE))","v":""},{"$f":"IF(AND(SumSheet!BM22>0,SumSheet!C22=\"A\"),SumSheet!B22,\"\")","v":""},"","","","","",null,{"$f":"IF(ISNA(VLOOKUP($W25,SeriesSummary,ClassRank,FALSE)),\"\",VLOOKUP($W25,SeriesSummary,ClassRank,FALSE))","v":""},{"$f":"IF(ISNA(VLOOKUP($W25,SeriesSummary,ChangeInClassRank,FALSE)),\"\",VLOOKUP($W25,SeriesSummary,ChangeInClassRank,FALSE))","v":""},{"$f":"IF(AND(SumSheet!BM22>0,SumSheet!C22=\"B\"),SumSheet!B22,\"\")","v":""},"","","","",""]
[null,{"$f":"IF(ISNA(VLOOKUP($D26,SeriesSummary,Rank,FALSE)),\"\",VLOOKUP($D26,SeriesSummary,Rank,FALSE))","v":""},{"$f":"IF(ISNA(VLOOKUP($D26,SeriesSummary,ChangeInRank,FALSE)),\"\",VLOOKUP($D26,SeriesSummary,ChangeInRank,FALSE))","v":""},{"$f":"IF(SumSheet!BM23>0,SumSheet!B23,\"\")","v":""},{"$f":"IF(SumSheet!BM23>0,SumSheet!C23,\"\")","v":""},"","","","","",null,{"$f":"IF(ISNA(VLOOKUP($N26,SeriesSummary,ClassRank,FALSE)),\"\",VLOOKUP($N26,SeriesSummary,ClassRank,FALSE))","v":""},{"$f":"IF(ISNA(VLOOKUP($N26,SeriesSummary,ChangeInClassRank,FALSE)),\"\",VLOOKUP($N26,SeriesSummary,ChangeInClassRank,FALSE))","v":""},{"$f":"IF(AND(SumSheet!BM23>0,SumSheet!C23=\"A\"),SumSheet!B23,\"\")","v":""},"","","","","",null,{"$f":"IF(ISNA(VLOOKUP($W26,SeriesSummary,ClassRank,FALSE)),\"\",VLOOKUP($W26,SeriesSummary,ClassRank,FALSE))","v":""},{"$f":"IF(ISNA(VLOOKUP($W26,SeriesSummary,ChangeInClassRank,FALSE)),\"\",VLOOKUP($W26,SeriesSummary,ChangeInClassRank,FALSE))","v":""},{"$f":"IF(AND(SumSheet!BM23>0,SumSheet!C23=\"B\"),SumSheet!B23,\"\")","v":""},"","","","",""]
[null,{"$f":"IF(ISNA(VLOOKUP($D27,SeriesSummary,Rank,FALSE)),\"\",VLOOKUP($D27,SeriesSummary,Rank,FALSE))","v":""},{"$f":"IF(ISNA(VLOOKUP($D27,SeriesSummary,ChangeInRank,FALSE)),\"\",VLOOKUP($D27,SeriesSummary,ChangeInRank,FALSE))","v":""},{"$f":"IF(SumSheet!BM24>0,SumSheet!B24,\"\")","v":""},{"$f":"IF(SumSheet!BM24>0,SumSheet!C24,\"\")","v":""},"","","","","",null,{"$f":"IF(ISNA(VLOOKUP($N27,SeriesSummary,ClassRank,FALSE)),\"\",VLOOKUP($N27,SeriesSummary,ClassRank,FALSE))","v":""},{"$f":"IF(ISNA(VLOOKUP($N27,SeriesSummary,ChangeInClassRank,FALSE)),\"\",VLOOKUP($N27,SeriesSummary,ChangeInClassRank,FALSE))","v":""},{"$f":"IF(AND(SumSheet!BM24>0,SumSheet!C24=\"A\"),SumSheet!B24,\"\")","v":""},"","","","","",null,{"$f":"IF(ISNA(VLOOKUP($W27,SeriesSummary,ClassRank,FALSE)),\"\",VLOOKUP($W27,SeriesSummary,ClassRank,FALSE))","v":""},{"$f":"IF(ISNA(VLOOKUP($W27,SeriesSummary,ChangeInClassRank,FALSE)),\"\",VLOOKUP($W27,SeriesSummary,ChangeInClassRank,FALSE))","v":""},{"$f":"IF(AND(SumSheet!BM24>0,SumSheet!C24=\"B\"),SumSheet!B24,\"\")","v":""},"","","","",""]
[null,{"$f":"IF(ISNA(VLOOKUP($D28,SeriesSummary,Rank,FALSE)),\"\",VLOOKUP($D28,SeriesSummary,Rank,FALSE))","v":""},{"$f":"IF(ISNA(VLOOKUP($D28,SeriesSummary,ChangeInRank,FALSE)),\"\",VLOOKUP($D28,SeriesSummary,ChangeInRank,FALSE))","v":""},{"$f":"IF(SumSheet!BM25>0,SumSheet!B25,\"\")","v":""},{"$f":"IF(SumSheet!BM25>0,SumSheet!C25,\"\")","v":""},"","","","","",null,{"$f":"IF(ISNA(VLOOKUP($N28,SeriesSummary,ClassRank,FALSE)),\"\",VLOOKUP($N28,SeriesSummary,ClassRank,FALSE))","v":""},{"$f":"IF(ISNA(VLOOKUP($N28,SeriesSummary,ChangeInClassRank,FALSE)),\"\",VLOOKUP($N28,SeriesSummary,ChangeInClassRank,FALSE))","v":""},{"$f":"IF(AND(SumSheet!BM25>0,SumSheet!C25=\"A\"),SumSheet!B25,\"\")","v":""},"","","","","",null,{"$f":"IF(ISNA(VLOOKUP($W28,SeriesSummary,ClassRank,FALSE)),\"\",VLOOKUP($W28,SeriesSummary,ClassRank,FALSE))","v":""},{"$f":"IF(ISNA(VLOOKUP($W28,SeriesSummary,ChangeInClassRank,FALSE)),\"\",VLOOKUP($W28,SeriesSummary,ChangeInClassRank,FALSE))","v":""},{"$f":"IF(AND(SumSheet!BM25>0,SumSheet!C25=\"B\"),SumSheet!B25,\"\")","v":""},"","","","",""]
[null,{"$f":"IF(ISNA(VLOOKUP($D29,SeriesSummary,Rank,FALSE)),\"\",VLOOKUP($D29,SeriesSummary,Rank,FALSE))","v":""},{"$f":"IF(ISNA(VLOOKUP($D29,SeriesSummary,ChangeInRank,FALSE)),\"\",VLOOKUP($D29,SeriesSummary,ChangeInRank,FALSE))","v":""},{"$f":"IF(SumSheet!BM26>0,SumSheet!B26,\"\")","v":""},{"$f":"IF(SumSheet!BM26>0,SumSheet!C26,\"\")","v":""},"","","","","",null,{"$f":"IF(ISNA(VLOOKUP($N29,SeriesSummary,ClassRank,FALSE)),\"\",VLOOKUP($N29,SeriesSummary,ClassRank,FALSE))","v":""},{"$f":"IF(ISNA(VLOOKUP($N29,SeriesSummary,ChangeInClassRank,FALSE)),\"\",VLOOKUP($N29,SeriesSummary,ChangeInClassRank,FALSE))","v":""},{"$f":"IF(AND(SumSheet!BM26>0,SumSheet!C26=\"A\"),SumSheet!B26,\"\")","v":""},"","","","","",null,{"$f":"IF(ISNA(VLOOKUP($W29,SeriesSummary,ClassRank,FALSE)),\"\",VLOOKUP($W29,SeriesSummary,ClassRank,FALSE))","v":""},{"$f":"IF(ISNA(VLOOKUP($W29,SeriesSummary,ChangeInClassRank,FALSE)),\"\",VLOOKUP($W29,SeriesSummary,ChangeInClassRank,FALSE))","v":""},{"$f":"IF(AND(SumSheet!BM26>0,SumSheet!C26=\"B\"),SumSheet!B26,\"\")","v":""},"","","","",""]
[null,{"$f":"IF(ISNA(VLOOKUP($D30,SeriesSummary,Rank,FALSE)),\"\",VLOOKUP($D30,SeriesSummary,Rank,FALSE))","v":""},{"$f":"IF(ISNA(VLOOKUP($D30,SeriesSummary,ChangeInRank,FALSE)),\"\",VLOOKUP($D30,SeriesSummary,ChangeInRank,FALSE))","v":""},{"$f":"IF(SumSheet!BM27>0,SumSheet!B27,\"\")","v":""},{"$f":"IF(SumSheet!BM27>0,SumSheet!C27,\"\")","v":""},"","","","","",null,{"$f":"IF(ISNA(VLOOKUP($N30,SeriesSummary,ClassRank,FALSE)),\"\",VLOOKUP($N30,SeriesSummary,ClassRank,FALSE))","v":""},{"$f":"IF(ISNA(VLOOKUP($N30,SeriesSummary,ChangeInClassRank,FALSE)),\"\",VLOOKUP($N30,SeriesSummary,ChangeInClassRank,FALSE))","v":""},{"$f":"IF(AND(SumSheet!BM27>0,SumSheet!C27=\"A\"),SumSheet!B27,\"\")","v":""},"","","","","",null,{"$f":"IF(ISNA(VLOOKUP($W30,SeriesSummary,ClassRank,FALSE)),\"\",VLOOKUP($W30,SeriesSummary,ClassRank,FALSE))","v":""},{"$f":"IF(ISNA(VLOOKUP($W30,SeriesSummary,ChangeInClassRank,FALSE)),\"\",VLOOKUP($W30,SeriesSummary,ChangeInClassRank,FALSE))","v":""},{"$f":"IF(AND(SumSheet!BM27>0,SumSheet!C27=\"B\"),SumSheet!B27,\"\")","v":""},"","","","",""]
[null,{"$f":"IF(ISNA(VLOOKUP($D31,SeriesSummary,Rank,FALSE)),\"\",VLOOKUP($D31,SeriesSummary,Rank,FALSE))","v":""},{"$f":"IF(ISNA(VLOOKUP($D31,SeriesSummary,ChangeInRank,FALSE)),\"\",VLOOKUP($D31,SeriesSummary,ChangeInRank,FALSE))","v":""},{"$f":"IF(SumSheet!BM28>0,SumSheet!B28,\"\")","v":""},{"$f":"IF(SumSheet!BM28>0,SumSheet!C28,\"\")","v":""},"","","","","",null,{"$f":"IF(ISNA(VLOOKUP($N31,SeriesSummary,ClassRank,FALSE)),\"\",VLOOKUP($N31,SeriesSummary,ClassRank,FALSE))","v":""},{"$f":"IF(ISNA(VLOOKUP($N31,SeriesSummary,ChangeInClassRank,FALSE)),\"\",VLOOKUP($N31,SeriesSummary,ChangeInClassRank,FALSE))","v":""},{"$f":"IF(AND(SumSheet!BM28>0,SumSheet!C28=\"A\"),SumSheet!B28,\"\")","v":""},"","","","","",null,{"$f":"IF(ISNA(VLOOKUP($W31,SeriesSummary,ClassRank,FALSE)),\"\",VLOOKUP($W31,SeriesSummary,ClassRank,FALSE))","v":""},{"$f":"IF(ISNA(VLOOKUP($W31,SeriesSummary,ChangeInClassRank,FALSE)),\"\",VLOOKUP($W31,SeriesSummary,ChangeInClassRank,FALSE))","v":""},{"$f":"IF(AND(SumSheet!BM28>0,SumSheet!C28=\"B\"),SumSheet!B28,\"\")","v":""},"","","","",""]

{"sheet":"Round 1","index":1,"n_rows":52,"n_cols":8,"rows_kept":52,"cut":false,"hidden":false,"merged":[[1,1,1,7]]}
[]
[null,{"$f":"SeriesName & \" - Round 1\"","v":"Can Am 2014 - Round 1"}]
[null,"Position","Driver","Laps","Fastest Lap","Group","Fastest Lap Bonus","Points"]
[null,1,"Roy M.",218.18,3.9430000000000001,{"$f":"IF(ISNA(VLOOKUP(C4,SeriesSummary,Group,FALSE)),\"\",VLOOKUP(C4,SeriesSummary,Group,FALSE))","v":"A"},{"$f":"IF(C4<>\"\",IF(AND(E4=MIN( IF( $F$4:$F$23=F4, $E$4:$E$23)),E4>0),1,0),\"\")","v":0},{"$f":"IF(ISNA(VLOOKUP(B4,Points,2,FALSE)),\"\",VLOOKUP(B4,Points,2,FALSE)+G4)","v":20}]
[null,2,"Russell M.",215.82,3.9420000000000002,"A",{"$f":"IF(C5<>\"\",IF(AND(E5=MIN( IF( $F$4:$F$23=F5, $E$4:$E$23)),E5>0),1,0),\"\")","v":0},19]
[null,3,"Marty M.",215.78,3.919,"A",{"$f":"IF(C6<>\"\",IF(AND(E6=MIN( IF( $F$4:$F$23=F6, $E$4:$E$23)),E6>0),1,0),\"\")","v":1},19]
[null,4,"Stephen B.",211.8,3.9609999999999999,"A",{"$f":"IF(C7<>\"\",IF(AND(E7=MIN( IF( $F$4:$F$23=F7, $E$4:$E$23)),E7>0),1,0),\"\")","v":0},17]
[null,5,"Austin C.",198.75,4.1130000000000004,"B",{"$f":"IF(C8<>\"\",IF(AND(E8=MIN( IF( $F$4:$F$23=F8, $E$4:$E$23)),E8>0),1,0),\"\")","v":1},17]
[null,6,"Jordan C.",196,4.2629999999999999,"B",{"$f":"IF(C9<>\"\",IF(AND(E9=MIN( IF( $F$4:$F$23=F9, $E$4:$E$23)),E9>0),1,0),\"\")","v":0},15]
[null,7,"David C.",183.95,4.4989999999999997,"B",{"$f":"IF(C10<>\"\",IF(AND(E10=MIN( IF( $F$4:$F$23=F10, $E$4:$E$23)),E10>0),1,0),\"\")","v":0},14]
[null,8,"Rich C.",181.8,4.5640000000000001,"B",{"$f":"IF(C11<>\"\",IF(AND(E11=MIN( IF( $F$4:$F$23=F11, $E$4:$E$23)),E11>0),1,0),\"\")","v":0},13]
[null,9,"Mark L.",175,4.4829999999999997,"B",{"$f":"IF(C12<>\"\",IF(AND(E12=MIN( IF( $F$4:$F$23=F12, $E$4:$E$23)),E12>0),1,0),\"\")","v":0},12]
[null,null,null,null,null,"",{"$f":"IF(C13<>\"\",IF(AND(E13=MIN( IF( $F$4:$F$23=F13, $E$4:$E$23)),E13>0),1,0),\"\")","v":""},""]
[null,null,null,null,null,"",{"$f":"IF(C14<>\"\",IF(AND(E14=MIN( IF( $F$4:$F$23=F14, $E$4:$E$23)),E14>0),1,0),\"\")","v":""},""]
[null,null,null,null,null,"",{"$f":"IF(C15<>\"\",IF(AND(E15=MIN( IF( $F$4:$F$23=F15, $E$4:$E$23)),E15>0),1,0),\"\")","v":""},""]
[null,null,null,null,null,"",{"$f":"IF(C16<>\"\",IF(AND(E16=MIN( IF( $F$4:$F$23=F16, $E$4:$E$23)),E16>0),1,0),\"\")","v":""},""]
[null,null,null,null,null,"",{"$f":"IF(C17<>\"\",IF(AND(E17=MIN( IF( $F$4:$F$23=F17, $E$4:$E$23)),E17>0),1,0),\"\")","v":""},""]
[null,null,null,null,null,"",{"$f":"IF(C18<>\"\",IF(AND(E18=MIN( IF( $F$4:$F$23=F18, $E$4:$E$23)),E18>0),1,0),\"\")","v":""},""]
[null,null,null,null,null,"",{"$f":"IF(C19<>\"\",IF(AND(E19=MIN( IF( $F$4:$F$23=F19, $E$4:$E$23)),E19>0),1,0),\"\")","v":""},""]
[null,null,null,null,null,"",{"$f":"IF(C20<>\"\",IF(AND(E20=MIN( IF( $F$4:$F$23=F20, $E$4:$E$23)),E20>0),1,0),\"\")","v":""},""]
[null,null,null,null,null,"",{"$f":"IF(C21<>\"\",IF(AND(E21=MIN( IF( $F$4:$F$23=F21, $E$4:$E$23)),E21>0),1,0),\"\")","v":""},""]
[null,null,null,null,null,"",{"$f":"IF(C22<>\"\",IF(AND(E22=MIN( IF( $F$4:$F$23=F22, $E$4:$E$23)),E22>0),1,0),\"\")","v":""},""]
[null,null,null,null,null,"",{"$f":"IF(C23<>\"\",IF(AND(E23=MIN( IF( $F$4:$F$23=F23, $E$4:$E$23)),E23>0),1,0),\"\")","v":""},""]
[]
[null,"Driver","Lane","Slowest Lap Time","Fastest Lap Time","Average Lap Time","Total Laps"]
[null,"Roy M.",1,6.4379999999999997,3.9430000000000001,4.1319999999999997,72.180000000000007]
[null,"Roy M.",2,4.3460000000000001,3.9710000000000001,4.0830000000000002,74]
[null,"Roy M.",3,6.23,3.9590000000000001,4.1740000000000004,72]
[null,"Russell M.",1,6.1130000000000004,3.9420000000000002,4.1310000000000002,72.819999999999993]
[null,"Russell M.",2,5.0019999999999998,3.9889999999999999,4.1390000000000002,72]
[null,"Russell M.",3,7.1319999999999997,3.9929999999999999,4.2469999999999999,71]
[null,"Marty M.",1,5.0309999999999997,3.9950000000000001,4.1660000000000004,72.78]
[null,"Marty M.",2,6.9569999999999999,3.919,4.1479999999999997,72]
[null,"Marty M.",3,6.7240000000000002,3.9780000000000002,4.2080000000000002,71]
[null,"Stephen B.",1,6.06,3.9609999999999999,4.2690000000000001,70.8]
[null,"Stephen B.",2,6.2110000000000003,4.0049999999999999,4.1989999999999998,72]
[null,"Stephen B.",3,6.8040000000000003,4.0030000000000001,4.3209999999999997,69]
[null,"Austin C.",1,6.6459999999999999,4.1890000000000001,4.51,66.75]
[null,"Austin C.",2,7.024,4.1130000000000004,4.6139999999999999,65]
[null,"Austin C.",3,7.27,4.1289999999999996,4.4610000000000003,67]
[null,"Jordan C.",1,8.4390000000000001,4.306,4.5069999999999997,67]
[null,"Jordan C.",2,6.351,4.2629999999999999,4.5010000000000003,66]
[null,"Jordan C.",3,6.18,4.45,4.7770000000000001,63]
[null,"David C.",1,7.1379999999999999,4.5289999999999999,4.952,60.95]
[null,"David C.",2,4.9119999999999999,4.4989999999999997,4.7439999999999998,63]
[null,"David C.",3,6.1609999999999996,4.6550000000000002,5.0069999999999997,60]
[null,"Rich C.",1,6.6779999999999999,4.6749999999999998,5.0019999999999998,60.8]
[null,"Rich C.",2,7.8929999999999998,4.5640000000000001,4.8410000000000002,62]
[null,"Rich C.",3,8.173,4.6429999999999998,5.03,59]
[null,"Mark L.",1,8.2720000000000002,4.4850000000000003,5.141,59]
[null,"Mark L.",2,9.8919999999999995,4.4829999999999997,4.9939999999999998,60]
[null,"Mark L.",3,8.08,4.5229999999999997,5.3129999999999997,56]

{"sheet":"Round 2","index":2,"n_rows":55,"n_cols":8,"rows_kept":55,"cut":false,"hidden":false,"merged":[[1,1,1,7]]}
[]
[null,{"$f":"SeriesName & \" - Round 2\"","v":"Can Am 2014 - Round 2"}]
[null,"Position","Driver","Laps","Fastest Lap","Group","Fastest Lap Bonus","Points"]
[null,1,"Russell M.",220.71,3.8690000000000002,{"$f":"IF(ISNA(VLOOKUP(C4,SeriesSummary,Group,FALSE)),\"\",VLOOKUP(C4,SeriesSummary,Group,FALSE))","v":"A"},{"$f":"IF(C4<>\"\",IF(AND(E4=MIN( IF( $F$4:$F$23=F4, $E$4:$E$23)),E4>0),1,0),\"\")","v":1},{"$f":"IF(ISNA(VLOOKUP(B4,Points,2,FALSE)),\"\",VLOOKUP(B4,Points,2,FALSE)+G4)","v":21}]
[null,2,"Marty M.",219.86,3.879,"A",{"$f":"IF(C5<>\"\",IF(AND(E5=MIN( IF( $F$4:$F$23=F5, $E$4:$E$23)),E5>0),1,0),\"\")","v":0},19]
[null,3,"Ary B.",219.78,3.9510000000000001,"A",{"$f":"IF(C6<>\"\",IF(AND(E6=MIN( IF( $F$4:$F$23=F6, $E$4:$E$23)),E6>0),1,0),\"\")","v":0},18]
[null,4,"Shawn G.",215.75,3.98,"A",{"$f":"IF(C7<>\"\",IF(AND(E7=MIN( IF( $F$4:$F$23=F7, $E$4:$E$23)),E7>0),1,0),\"\")","v":0},17]
[null,5,"Roy M.",214.3,3.9569999999999999,"A",{"$f":"IF(C8<>\"\",IF(AND(E8=MIN( IF( $F$4:$F$23=F8, $E$4:$E$23)),E8>0),1,0),\"\")","v":0},16]
[null,6,"Stephen B.",211.25,4.0670000000000002,"A",{"$f":"IF(C9<>\"\",IF(AND(E9=MIN( IF( $F$4:$F$23=F9, $E$4:$E$23)),E9>0),1,0),\"\")","v":0},15]
[null,7,"Jordan C.",205.6,4.1689999999999996,"B",{"$f":"IF(C10<>\"\",IF(AND(E10=MIN( IF( $F$4:$F$23=F10, $E$4:$E$23)),E10>0),1,0),\"\")","v":1},15]
[null,8,"Rich C.",195.84,4.2569999999999997,"B",{"$f":"IF(C11<>\"\",IF(AND(E11=MIN( IF( $F$4:$F$23=F11, $E$4:$E$23)),E11>0),1,0),\"\")","v":0},13]
[null,9,"David C.",181.99,4.3840000000000003,"B",{"$f":"IF(C12<>\"\",IF(AND(E12=MIN( IF( $F$4:$F$23=F12, $E$4:$E$23)),E12>0),1,0),\"\")","v":0},12]
[null,10,"Mark L.",180.61,4.5339999999999998,"B",{"$f":"IF(C13<>\"\",IF(AND(E13=MIN( IF( $F$4:$F$23=F13, $E$4:$E$23)),E13>0),1,0),\"\")","v":0},11]
[null,null,null,null,null,"",{"$f":"IF(C14<>\"\",IF(AND(E14=MIN( IF( $F$4:$F$23=F14, $E$4:$E$23)),E14>0),1,0),\"\")","v":""},""]
[null,null,null,null,null,"",{"$f":"IF(C15<>\"\",IF(AND(E15=MIN( IF( $F$4:$F$23=F15, $E$4:$E$23)),E15>0),1,0),\"\")","v":""},""]
[null,null,null,null,null,"",{"$f":"IF(C16<>\"\",IF(AND(E16=MIN( IF( $F$4:$F$23=F16, $E$4:$E$23)),E16>0),1,0),\"\")","v":""},""]
[null,null,null,null,null,"",{"$f":"IF(C17<>\"\",IF(AND(E17=MIN( IF( $F$4:$F$23=F17, $E$4:$E$23)),E17>0),1,0),\"\")","v":""},""]
[null,null,null,null,null,"",{"$f":"IF(C18<>\"\",IF(AND(E18=MIN( IF( $F$4:$F$23=F18, $E$4:$E$23)),E18>0),1,0),\"\")","v":""},""]
[null,null,null,null,null,"",{"$f":"IF(C19<>\"\",IF(AND(E19=MIN( IF( $F$4:$F$23=F19, $E$4:$E$23)),E19>0),1,0),\"\")","v":""},""]
[null,null,null,null,null,"",{"$f":"IF(C20<>\"\",IF(AND(E20=MIN( IF( $F$4:$F$23=F20, $E$4:$E$23)),E20>0),1,0),\"\")","v":""},""]
[null,null,null,null,null,"",{"$f":"IF(C21<>\"\",IF(AND(E21=MIN( IF( $F$4:$F$23=F21, $E$4:$E$23)),E21>0),1,0),\"\")","v":""},""]
[null,null,null,null,null,"",{"$f":"IF(C22<>\"\",IF(AND(E22=MIN( IF( $F$4:$F$23=F22, $E$4:$E$23)),E22>0),1,0),\"\")","v":""},""]
[null,null,null,null,null,"",{"$f":"IF(C23<>\"\",IF(AND(E23=MIN( IF( $F$4:$F$23=F23, $E$4:$E$23)),E23>0),1,0),\"\")","v":""},""]
[]
[null,"Driver","Lane","Slowest Lap Time","Fastest Lap Time","Average Lap Time","Total Laps"]
[null,"Russell M.",1,5.8579999999999997,3.8690000000000002,4.093,73]
[null,"Russell M.",2,4.6609999999999996,3.93,4.0439999999999996,74]
[null,"Russell M.",3,6.008,3.9380000000000002,4.1120000000000001,73]
[null,"Marty M.",1,4.6059999999999999,3.9319999999999999,4.0670000000000002,73]
[null,"Marty M.",2,5.9610000000000003,3.879,4.1219999999999999,72]
[null,"Marty M.",3,5.9210000000000003,3.9430000000000001,4.1040000000000001,74]
[null,"Ary B.",1,4.9630000000000001,3.9569999999999999,4.0620000000000003,73]
[null,"Ary B.",2,6.3460000000000001,3.97,4.1459999999999999,72]
[null,"Ary B.",3,5.8330000000000002,3.9510000000000001,4.0880000000000001,74]
[null,"Shawn G.",1,5.9820000000000002,4.0119999999999996,4.1879999999999997,71]
[null,"Shawn G.",2,5.9850000000000003,4.0090000000000003,4.1950000000000003,71]
[null,"Shawn G.",3,5.56,3.98,4.1379999999999999,73]
[null,"Roy M.",1,4.726,4.0259999999999998,4.1760000000000002,71]
[null,"Roy M.",2,4.327,3.9569999999999999,4.1239999999999997,73]
[null,"Roy M.",3,8.2639999999999993,4.0019999999999998,4.3140000000000001,70]
[null,"Stephen B.",1,5.1529999999999996,4.0940000000000003,4.3019999999999996,69]
[null,"Stephen B.",2,4.59,4.0960000000000001,4.2530000000000001,71]
[null,"Stephen B.",3,7.0650000000000004,4.0670000000000002,4.2409999999999997,71]
[null,"Jordan C.",1,5.3010000000000002,4.3090000000000002,4.4080000000000004,68]
[null,"Jordan C.",2,5.9569999999999999,4.1689999999999996,4.335,69]
[null,"Jordan C.",3,4.6609999999999996,4.2460000000000004,4.399,68]
[null,"Rich C.",1,4.9820000000000002,4.3490000000000002,4.5140000000000002,66]
[null,"Rich C.",2,8.4740000000000002,4.2569999999999997,4.5510000000000002,66]
[null,"Rich C.",3,8.1750000000000007,4.3159999999999998,4.7359999999999998,63]
[null,"David C.",1,7.8369999999999997,4.4729999999999999,5.1139999999999999,58]
[null,"David C.",2,6.8959999999999999,4.3840000000000003,4.7850000000000001,62]
[null,"David C.",3,6.99,4.5149999999999997,4.9649999999999999,61]
[null,"Mark L.",1,7.66,4.5670000000000002,5.0919999999999996,59]
[null,"Mark L.",2,7.0529999999999999,4.5359999999999996,4.891,61]
[null,"Mark L.",3,8.2430000000000003,4.5339999999999998,4.9790000000000001,60]

{"sheet":"Round 3","index":3,"n_rows":46,"n_cols":8,"rows_kept":46,"cut":false,"hidden":false,"merged":[[1,1,1,7]]}
[]
[null,{"$f":"SeriesName & \" - Round 3\"","v":"Can Am 2014 - Round 3"}]
[null,"Position","Driver","Laps","Fastest Lap","Group","Fastest Lap Bonus","Points"]
[null,1,"Marty M.",223.31,3.891,{"$f":"IF(ISNA(VLOOKUP(C4,SeriesSummary,Group,FALSE)),\"\",VLOOKUP(C4,SeriesSummary,Group,FALSE))","v":"A"},{"$f":"IF(C4<>\"\",IF(AND(E4=MIN( IF( $F$4:$F$23=F4, $E$4:$E$23)),E4>0),1,0),\"\")","v":0},{"$f":"IF(ISNA(VLOOKUP(B4,Points,2,FALSE)),\"\",VLOOKUP(B4,Points,2,FALSE)+G4)","v":20}]
[null,2,"Russell M.",221.41,3.8639999999999999,"A",{"$f":"IF(C5<>\"\",IF(AND(E5=MIN( IF( $F$4:$F$23=F5, $E$4:$E$23)),E5>0),1,0),\"\")","v":1},20]
[null,3,"Ary B.",219.2,3.9060000000000001,"A",{"$f":"IF(C6<>\"\",IF(AND(E6=MIN( IF( $F$4:$F$23=F6, $E$4:$E$23)),E6>0),1,0),\"\")","v":0},18]
[null,4,"Jordan C.",215.8,3.992,"B",{"$f":"IF(C7<>\"\",IF(AND(E7=MIN( IF( $F$4:$F$23=F7, $E$4:$E$23)),E7>0),1,0),\"\")","v":1},18]
[null,5,"Stephen B.",213.58,4.0190000000000001,"A",{"$f":"IF(C8<>\"\",IF(AND(E8=MIN( IF( $F$4:$F$23=F8, $E$4:$E$23)),E8>0),1,0),\"\")","v":0},16]
[null,6,"David C.",190.95,4.37,"B",{"$f":"IF(C9<>\"\",IF(AND(E9=MIN( IF( $F$4:$F$23=F9, $E$4:$E$23)),E9>0),1,0),\"\")","v":0},15]
[null,7,"Mark L.",182.31,4.4370000000000003,"B",{"$f":"IF(C10<>\"\",IF(AND(E10=MIN( IF( $F$4:$F$23=F10, $E$4:$E$23)),E10>0),1,0),\"\")","v":0},14]
[null,null,null,null,null,"",{"$f":"IF(C11<>\"\",IF(AND(E11=MIN( IF( $F$4:$F$23=F11, $E$4:$E$23)),E11>0),1,0),\"\")","v":""},""]
[null,null,null,null,null,"",{"$f":"IF(C12<>\"\",IF(AND(E12=MIN( IF( $F$4:$F$23=F12, $E$4:$E$23)),E12>0),1,0),\"\")","v":""},""]
[null,null,null,null,null,"",{"$f":"IF(C13<>\"\",IF(AND(E13=MIN( IF( $F$4:$F$23=F13, $E$4:$E$23)),E13>0),1,0),\"\")","v":""},""]
[null,null,null,null,null,"",{"$f":"IF(C14<>\"\",IF(AND(E14=MIN( IF( $F$4:$F$23=F14, $E$4:$E$23)),E14>0),1,0),\"\")","v":""},""]
[null,null,null,null,null,"",{"$f":"IF(C15<>\"\",IF(AND(E15=MIN( IF( $F$4:$F$23=F15, $E$4:$E$23)),E15>0),1,0),\"\")","v":""},""]
[null,null,null,null,null,"",{"$f":"IF(C16<>\"\",IF(AND(E16=MIN( IF( $F$4:$F$23=F16, $E$4:$E$23)),E16>0),1,0),\"\")","v":""},""]
[null,null,null,null,null,"",{"$f":"IF(C17<>\"\",IF(AND(E17=MIN( IF( $F$4:$F$23=F17, $E$4:$E$23)),E17>0),1,0),\"\")","v":""},""]
[null,null,null,null,null,"",{"$f":"IF(C18<>\"\",IF(AND(E18=MIN( IF( $F$4:$F$23=F18, $E$4:$E$23)),E18>0),1,0),\"\")","v":""},""]
[null,null,null,null,null,"",{"$f":"IF(C19<>\"\",IF(AND(E19=MIN( IF( $F$4:$F$23=F19, $E$4:$E$23)),E19>0),1,0),\"\")","v":""},""]
[null,null,null,null,null,"",{"$f":"IF(C20<>\"\",IF(AND(E20=MIN( IF( $F$4:$F$23=F20, $E$4:$E$23)),E20>0),1,0),\"\")","v":""},""]
[null,null,null,null,null,"",{"$f":"IF(C21<>\"\",IF(AND(E21=MIN( IF( $F$4:$F$23=F21, $E$4:$E$23)),E21>0),1,0),\"\")","v":""},""]
[null,null,null,null,null,"",{"$f":"IF(C22<>\"\",IF(AND(E22=MIN( IF( $F$4:$F$23=F22, $E$4:$E$23)),E22>0),1,0),\"\")","v":""},""]
[null,null,null,null,null,"",{"$f":"IF(C23<>\"\",IF(AND(E23=MIN( IF( $F$4:$F$23=F23, $E$4:$E$23)),E23>0),1,0),\"\")","v":""},""]
[]
[null,"Driver","Lane","Slowest Lap Time","Fastest Lap Time","Average Lap Time","Total Laps"]
[null,"Marty M.",1,5.7370000000000001,3.891,4.0430000000000001,76.31]
[null,"Marty M.",2,4.74,3.9260000000000002,4.101,73]
[null,"Marty M.",3,4.3360000000000003,3.895,4.0819999999999999,74]
[null,"Russell M.",1,5.6369999999999996,3.8660000000000001,4.0259999999999998,74.41]
[null,"Russell M.",2,7.26,3.8639999999999999,4.125,73]
[null,"Russell M.",3,5.8170000000000002,3.899,4.0540000000000003,74]
[null,"Ary B.",1,6.8780000000000001,3.94,4.125,72.2]
[null,"Ary B.",2,5.1589999999999998,3.9060000000000001,4.048,75]
[null,"Ary B.",3,6.5960000000000001,3.93,4.1619999999999999,72]
[null,"Jordan C.",1,5.1559999999999997,3.992,4.101,73.8]
[null,"Jordan C.",2,7.57,4.0330000000000004,4.2110000000000003,71]
[null,"Jordan C.",3,6.3010000000000002,4.0229999999999997,4.2110000000000003,71]
[null,"Stephen B.",1,7.633,4.032,4.2050000000000001,71.58]
[null,"Stephen B.",2,6.5830000000000002,4.0190000000000001,4.2229999999999999,71]
[null,"Stephen B.",3,4.4370000000000003,4.069,4.2190000000000003,71]
[null,"David C.",1,5.5270000000000001,4.37,4.5759999999999996,65.95]
[null,"David C.",2,5.44,4.4219999999999997,4.6509999999999998,65]
[null,"David C.",3,7.6120000000000001,4.5880000000000001,4.9429999999999996,60]
[null,"Mark L.",1,6.9390000000000001,4.4370000000000003,4.9640000000000004,60.31]
[null,"Mark L.",2,7.3339999999999996,4.4749999999999996,4.9260000000000002,61]
[null,"Mark L.",3,6.6520000000000001,4.4370000000000003,4.9329999999999998,61]

{"sheet":"Round 4","index":4,"n_rows":46,"n_cols":8,"rows_kept":46,"cut":false,"hidden":false,"merged":[[1,1,1,7]]}
[]
[null,{"$f":"SeriesName & \" - Round 4\"","v":"Can Am 2014 - Round 4"}]
[null,"Position","Driver","Laps","Fastest Lap","Group","Fastest Lap Bonus","Points"]
[null,1,"Russell M.",226.31,3.8029999999999999,{"$f":"IF(ISNA(VLOOKUP(C4,SeriesSummary,Group,FALSE)),\"\",VLOOKUP(C4,SeriesSummary,Group,FALSE))","v":"A"},{"$f":"IF(C4<>\"\",IF(AND(E4=MIN( IF( $F$4:$F$23=F4, $E$4:$E$23)),E4>0),1,0),\"\")","v":1},{"$f":"IF(ISNA(VLOOKUP(B4,Points,2,FALSE)),\"\",VLOOKUP(B4,Points,2,FALSE)+G4)","v":21}]
[null,2,"Jordan C.",217.8,3.976,"B",{"$f":"IF(C5<>\"\",IF(AND(E5=MIN( IF( $F$4:$F$23=F5, $E$4:$E$23)),E5>0),1,0),\"\")","v":1},20]
[null,3,"Roy M.",216.45,3.94,"A",{"$f":"IF(C6<>\"\",IF(AND(E6=MIN( IF( $F$4:$F$23=F6, $E$4:$E$23)),E6>0),1,0),\"\")","v":0},18]
[null,4,"Stephen B.",213.21,3.9449999999999998,"A",{"$f":"IF(C7<>\"\",IF(AND(E7=MIN( IF( $F$4:$F$23=F7, $E$4:$E$23)),E7>0),1,0),\"\")","v":0},17]
[null,5,"Rich C.",202.45,4.1719999999999997,"B",{"$f":"IF(C8<>\"\",IF(AND(E8=MIN( IF( $F$4:$F$23=F8, $E$4:$E$23)),E8>0),1,0),\"\")","v":0},16]
[null,6,"David C.",191.8,4.298,"B",{"$f":"IF(C9<>\"\",IF(AND(E9=MIN( IF( $F$4:$F$23=F9, $E$4:$E$23)),E9>0),1,0),\"\")","v":0},15]
[null,7,"Mark L.",183.78,4.3609999999999998,"B",{"$f":"IF(C10<>\"\",IF(AND(E10=MIN( IF( $F$4:$F$23=F10, $E$4:$E$23)),E10>0),1,0),\"\")","v":0},14]
[null,null,null,null,null,"",{"$f":"IF(C11<>\"\",IF(AND(E11=MIN( IF( $F$4:$F$23=F11, $E$4:$E$23)),E11>0),1,0),\"\")","v":""},""]
[null,null,null,null,null,"",{"$f":"IF(C12<>\"\",IF(AND(E12=MIN( IF( $F$4:$F$23=F12, $E$4:$E$23)),E12>0),1,0),\"\")","v":""},""]
[null,null,null,null,null,"",{"$f":"IF(C13<>\"\",IF(AND(E13=MIN( IF( $F$4:$F$23=F13, $E$4:$E$23)),E13>0),1,0),\"\")","v":""},""]
[null,null,null,null,null,"",{"$f":"IF(C14<>\"\",IF(AND(E14=MIN( IF( $F$4:$F$23=F14, $E$4:$E$23)),E14>0),1,0),\"\")","v":""},""]
[null,null,null,null,null,"",{"$f":"IF(C15<>\"\",IF(AND(E15=MIN( IF( $F$4:$F$23=F15, $E$4:$E$23)),E15>0),1,0),\"\")","v":""},""]
[null,null,null,null,null,"",{"$f":"IF(C16<>\"\",IF(AND(E16=MIN( IF( $F$4:$F$23=F16, $E$4:$E$23)),E16>0),1,0),\"\")","v":""},""]
[null,null,null,null,null,"",{"$f":"IF(C17<>\"\",IF(AND(E17=MIN( IF( $F$4:$F$23=F17, $E$4:$E$23)),E17>0),1,0),\"\")","v":""},""]
[null,null,null,null,null,"",{"$f":"IF(C18<>\"\",IF(AND(E18=MIN( IF( $F$4:$F$23=F18, $E$4:$E$23)),E18>0),1,0),\"\")","v":""},""]
[null,null,null,null,null,"",{"$f":"IF(C19<>\"\",IF(AND(E19=MIN( IF( $F$4:$F$23=F19, $E$4:$E$23)),E19>0),1,0),\"\")","v":""},""]
[null,null,null,null,null,"",{"$f":"IF(C20<>\"\",IF(AND(E20=MIN( IF( $F$4:$F$23=F20, $E$4:$E$23)),E20>0),1,0),\"\")","v":""},""]
[null,null,null,null,null,"",{"$f":"IF(C21<>\"\",IF(AND(E21=MIN( IF( $F$4:$F$23=F21, $E$4:$E$23)),E21>0),1,0),\"\")","v":""},""]
[null,null,null,null,null,"",{"$f":"IF(C22<>\"\",IF(AND(E22=MIN( IF( $F$4:$F$23=F22, $E$4:$E$23)),E22>0),1,0),\"\")","v":""},""]
[null,null,null,null,null,"",{"$f":"IF(C23<>\"\",IF(AND(E23=MIN( IF( $F$4:$F$23=F23, $E$4:$E$23)),E23>0),1,0),\"\")","v":""},""]
[]
[null,"Driver","Lane","Slowest Lap Time","Fastest Lap Time","Average Lap Time","Total Laps"]
[null,"Russell M.",1,5.4409999999999998,3.8029999999999999,3.9220000000000002,76.31]
[null,"Russell M.",2,5.0430000000000001,3.8889999999999998,4.05,74]
[null,"Russell M.",3,5.133,3.855,3.9820000000000002,76]
[null,"Jordan C.",1,4.7690000000000001,4.0289999999999999,4.1669999999999998,72.8]
[null,"Jordan C.",2,4.2110000000000003,3.976,4.1340000000000003,72]
[null,"Jordan C.",3,4.3550000000000004,4.0209999999999999,4.1120000000000001,73]
[null,"Roy M.",1,4.5250000000000004,4.0259999999999998,4.2069999999999999,71.45]
[null,"Roy M.",2,7.077,3.94,4.1680000000000001,73]
[null,"Roy M.",3,6.0549999999999997,3.9489999999999998,4.1159999999999997,72]
[null,"Stephen B.",1,7.3150000000000004,3.988,4.2329999999999997,71.209999999999994]
[null,"Stephen B.",2,7.2670000000000003,3.9449999999999998,4.2560000000000002,71]
[null,"Stephen B.",3,4.468,3.9449999999999998,4.258,71]
[null,"Rich C.",1,9.3140000000000001,4.2300000000000004,4.4859999999999998,68.45]
[null,"Rich C.",2,7.44,4.1929999999999996,4.4870000000000001,67]
[null,"Rich C.",3,7.327,4.1719999999999997,4.516,67]
[null,"David C.",1,6.7380000000000004,4.298,4.6029999999999998,65.8]
[null,"David C.",2,7.0650000000000004,4.5119999999999996,4.7249999999999996,63]
[null,"David C.",3,8.7070000000000007,4.4390000000000001,4.766,63]
[null,"Mark L.",1,7.407,4.5490000000000004,5.0049999999999999,60.78]
[null,"Mark L.",2,6.8179999999999996,4.3609999999999998,4.7350000000000003,63]
[null,"Mark L.",3,7.3570000000000002,4.3860000000000001,4.9800000000000004,60]

{"sheet":"Round 5","index":5,"n_rows":55,"n_cols":8,"rows_kept":55,"cut":false,"hidden":false,"merged":[[1,1,1,7]]}
[]
[null,{"$f":"SeriesName & \" - Round 5\"","v":"Can Am 2014 - Round 5"}]
[null,"Position","Driver","Laps","Fastest Lap","Group","Fastest Lap Bonus","Points"]
[null,1,"Russell M.",221.3,3.839,{"$f":"IF(ISNA(VLOOKUP(C4,SeriesSummary,Group,FALSE)),\"\",VLOOKUP(C4,SeriesSummary,Group,FALSE))","v":"A"},{"$f":"IF(C4<>\"\",IF(AND(E4=MIN( IF( $F$4:$F$23=F4, $E$4:$E$23)),E4>0),1,0),\"\")","v":0},{"$f":"IF(ISNA(VLOOKUP(B4,Points,2,FALSE)),\"\",VLOOKUP(B4,Points,2,FALSE)+G4)","v":20}]
[null,2,"Roy M.",218.4,3.9239999999999999,"A",{"$f":"IF(C5<>\"\",IF(AND(E5=MIN( IF( $F$4:$F$23=F5, $E$4:$E$23)),E5>0),1,0),\"\")","v":0},19]
[null,3,"Jordan C.",213.77,4.0119999999999996,"B",{"$f":"IF(C6<>\"\",IF(AND(E6=MIN( IF( $F$4:$F$23=F6, $E$4:$E$23)),E6>0),1,0),\"\")","v":1},19]
[null,4,"Shawn G.",212.46,4.0309999999999997,"A",{"$f":"IF(C7<>\"\",IF(AND(E7=MIN( IF( $F$4:$F$23=F7, $E$4:$E$23)),E7>0),1,0),\"\")","v":0},17]
[null,5,"Stephen B.",207.38,4.048,"A",{"$f":"IF(C8<>\"\",IF(AND(E8=MIN( IF( $F$4:$F$23=F8, $E$4:$E$23)),E8>0),1,0),\"\")","v":0},16]
[null,6,"Rich C.",200.35,4.2240000000000002,"B",{"$f":"IF(C9<>\"\",IF(AND(E9=MIN( IF( $F$4:$F$23=F9, $E$4:$E$23)),E9>0),1,0),\"\")","v":0},15]
[null,7,"Austin C.",196.45,4.1260000000000003,"B",{"$f":"IF(C10<>\"\",IF(AND(E10=MIN( IF( $F$4:$F$23=F10, $E$4:$E$23)),E10>0),1,0),\"\")","v":0},14]
[null,8,"David C.",183.45,4.4370000000000003,"B",{"$f":"IF(C11<>\"\",IF(AND(E11=MIN( IF( $F$4:$F$23=F11, $E$4:$E$23)),E11>0),1,0),\"\")","v":0},13]
[null,9,"Mark L.",173.87,4.6479999999999997,"B",{"$f":"IF(C12<>\"\",IF(AND(E12=MIN( IF( $F$4:$F$23=F12, $E$4:$E$23)),E12>0),1,0),\"\")","v":0},12]
[null,10,"Ary B.",150.44999999999999,3.8140000000000001,"A",{"$f":"IF(C13<>\"\",IF(AND(E13=MIN( IF( $F$4:$F$23=F13, $E$4:$E$23)),E13>0),1,0),\"\")","v":1},12]
[null,null,null,null,null,"",{"$f":"IF(C14<>\"\",IF(AND(E14=MIN( IF( $F$4:$F$23=F14, $E$4:$E$23)),E14>0),1,0),\"\")","v":""},""]
[null,null,null,null,null,"",{"$f":"IF(C15<>\"\",IF(AND(E15=MIN( IF( $F$4:$F$23=F15, $E$4:$E$23)),E15>0),1,0),\"\")","v":""},""]
[null,null,null,null,null,"",{"$f":"IF(C16<>\"\",IF(AND(E16=MIN( IF( $F$4:$F$23=F16, $E$4:$E$23)),E16>0),1,0),\"\")","v":""},""]
[null,null,null,null,null,"",{"$f":"IF(C17<>\"\",IF(AND(E17=MIN( IF( $F$4:$F$23=F17, $E$4:$E$23)),E17>0),1,0),\"\")","v":""},""]
[null,null,null,null,null,"",{"$f":"IF(C18<>\"\",IF(AND(E18=MIN( IF( $F$4:$F$23=F18, $E$4:$E$23)),E18>0),1,0),\"\")","v":""},""]
[null,null,null,null,null,"",{"$f":"IF(C19<>\"\",IF(AND(E19=MIN( IF( $F$4:$F$23=F19, $E$4:$E$23)),E19>0),1,0),\"\")","v":""},""]
[null,null,null,null,null,"",{"$f":"IF(C20<>\"\",IF(AND(E20=MIN( IF( $F$4:$F$23=F20, $E$4:$E$23)),E20>0),1,0),\"\")","v":""},""]
[null,null,null,null,null,"",{"$f":"IF(C21<>\"\",IF(AND(E21=MIN( IF( $F$4:$F$23=F21, $E$4:$E$23)),E21>0),1,0),\"\")","v":""},""]
[null,null,null,null,null,"",{"$f":"IF(C22<>\"\",IF(AND(E22=MIN( IF( $F$4:$F$23=F22, $E$4:$E$23)),E22>0),1,0),\"\")","v":""},""]
[null,null,null,null,null,"",{"$f":"IF(C23<>\"\",IF(AND(E23=MIN( IF( $F$4:$F$23=F23, $E$4:$E$23)),E23>0),1,0),\"\")","v":""},""]
[]
[null,"Driver","Lane","Slowest Lap Time","Fastest Lap Time","Average Lap Time","Total Laps"]
[null,"Russell M.",1,6.202,3.8809999999999998,4.0430000000000001,74.3]
[null,"Russell M.",2,5.13,3.8690000000000002,4.0049999999999999,75]
[null,"Russell M.",3,6.1769999999999996,3.839,4.1710000000000003,72]
[null,"Roy M.",1,4.5780000000000003,3.9889999999999999,4.133,73.400000000000006]
[null,"Roy M.",2,6.2750000000000004,3.9239999999999999,4.13,72]
[null,"Roy M.",3,4.66,3.99,4.1139999999999999,73]
[null,"Jordan C.",1,6.3949999999999996,4.085,4.3129999999999997,69.77]
[null,"Jordan C.",2,4.3769999999999998,4.0119999999999996,4.0960000000000001,73]
[null,"Jordan C.",3,6.125,4.0430000000000001,4.2409999999999997,71]
[null,"Shawn G.",1,5.194,4.165,4.3419999999999996,69.459999999999994]
[null,"Shawn G.",2,5.8120000000000003,4.0510000000000002,4.2229999999999999,71]
[null,"Shawn G.",3,4.6520000000000001,4.0309999999999997,4.1509999999999998,72]
[null,"Stephen B.",1,5.8940000000000001,4.1130000000000004,4.367,68.38]
[null,"Stephen B.",2,6.66,4.048,4.2919999999999998,70]
[null,"Stephen B.",3,6.0789999999999997,4.0789999999999997,4.375,69]
[null,"Rich C.",1,6.6029999999999998,4.2240000000000002,4.5140000000000002,66.349999999999994]
[null,"Rich C.",2,6.9530000000000003,4.2480000000000002,4.4569999999999999,68]
[null,"Rich C.",3,8.5540000000000003,4.3070000000000004,4.5270000000000001,66]
[null,"Austin C.",1,7.0129999999999999,4.2130000000000001,4.6059999999999999,65.45]
[null,"Austin C.",2,7.4619999999999997,4.1260000000000003,4.5640000000000001,66]
[null,"Austin C.",3,8.8529999999999998,4.149,4.5940000000000003,65]
[null,"David C.",1,7.37,4.4370000000000003,4.8250000000000002,62.45]
[null,"David C.",2,6.9809999999999999,4.4820000000000002,4.843,62]
[null,"David C.",3,8.9329999999999998,4.524,5.0679999999999996,59]
[null,"Mark L.",1,5.7469999999999999,4.9390000000000001,5.3250000000000002,56.87]
[null,"Mark L.",2,5.91,4.6479999999999997,5.0869999999999997,58]
[null,"Mark L.",3,7.1310000000000002,4.7469999999999999,5.1120000000000001,59]
[null,"Ary B.",1,29.381,3.903,5.4710000000000001,51.45]
[null,"Ary B.",2,31.616,3.899,6.1390000000000002,49]
[null,"Ary B.",3,32.268999999999998,3.8140000000000001,6.3769999999999998,50]

{"sheet":"Round 6","index":6,"n_rows":25,"n_cols":8,"rows_kept":25,"cut":false,"hidden":false,"merged":[[1,1,1,7]]}
[]
[null,{"$f":"SeriesName & \" - Round 6\"","v":"Can Am 2014 - Round 6"}]
[null,"Position","Driver","Laps","Fastest Lap","Group","Fastest Lap Bonus","Points"]
[null,null,null,null,null,{"$f":"IF(ISNA(VLOOKUP(C4,SeriesSummary,Group,FALSE)),\"\",VLOOKUP(C4,SeriesSummary,Group,FALSE))","v":""},{"$f":"IF(C4<>\"\",IF(AND(E4=MIN( IF( $F$4:$F$23=F4, $E$4:$E$23)),E4>0),1,0),\"\")","v":""},{"$f":"IF(ISNA(VLOOKUP(B4,Points,2,FALSE)),\"\",VLOOKUP(B4,Points,2,FALSE)+G4)","v":""}]
[null,null,null,null,null,"",{"$f":"IF(C5<>\"\",IF(AND(E5=MIN( IF( $F$4:$F$23=F5, $E$4:$E$23)),E5>0),1,0),\"\")","v":""},""]
[null,null,null,null,null,"",{"$f":"IF(C6<>\"\",IF(AND(E6=MIN( IF( $F$4:$F$23=F6, $E$4:$E$23)),E6>0),1,0),\"\")","v":""},""]
[null,null,null,null,null,"",{"$f":"IF(C7<>\"\",IF(AND(E7=MIN( IF( $F$4:$F$23=F7, $E$4:$E$23)),E7>0),1,0),\"\")","v":""},""]
[null,null,null,null,null,"",{"$f":"IF(C8<>\"\",IF(AND(E8=MIN( IF( $F$4:$F$23=F8, $E$4:$E$23)),E8>0),1,0),\"\")","v":""},""]
[null,null,null,null,null,"",{"$f":"IF(C9<>\"\",IF(AND(E9=MIN( IF( $F$4:$F$23=F9, $E$4:$E$23)),E9>0),1,0),\"\")","v":""},""]
[null,null,null,null,null,"",{"$f":"IF(C10<>\"\",IF(AND(E10=MIN( IF( $F$4:$F$23=F10, $E$4:$E$23)),E10>0),1,0),\"\")","v":""},""]
[null,null,null,null,null,"",{"$f":"IF(C11<>\"\",IF(AND(E11=MIN( IF( $F$4:$F$23=F11, $E$4:$E$23)),E11>0),1,0),\"\")","v":""},""]
[null,null,null,null,null,"",{"$f":"IF(C12<>\"\",IF(AND(E12=MIN( IF( $F$4:$F$23=F12, $E$4:$E$23)),E12>0),1,0),\"\")","v":""},""]
[null,null,null,null,null,"",{"$f":"IF(C13<>\"\",IF(AND(E13=MIN( IF( $F$4:$F$23=F13, $E$4:$E$23)),E13>0),1,0),\"\")","v":""},""]
[null,null,null,null,null,"",{"$f":"IF(C14<>\"\",IF(AND(E14=MIN( IF( $F$4:$F$23=F14, $E$4:$E$23)),E14>0),1,0),\"\")","v":""},""]
[null,null,null,null,null,"",{"$f":"IF(C15<>\"\",IF(AND(E15=MIN( IF( $F$4:$F$23=F15, $E$4:$E$23)),E15>0),1,0),\"\")","v":""},""]
[null,null,null,null,null,"",{"$f":"IF(C16<>\"\",IF(AND(E16=MIN( IF( $F$4:$F$23=F16, $E$4:$E$23)),E16>0),1,0),\"\")","v":""},""]
[null,null,null,null,null,"",{"$f":"IF(C17<>\"\",IF(AND(E17=MIN( IF( $F$4:$F$23=F17, $E$4:$E$23)),E17>0),1,0),\"\")","v":""},""]
[null,null,null,null,null,"",{"$f":"IF(C18<>\"\",IF(AND(E18=MIN( IF( $F$4:$F$23=F18, $E$4:$E$23)),E18>0),1,0),\"\")","v":""},""]
[null,null,null,null,null,"",{"$f":"IF(C19<>\"\",IF(AND(E19=MIN( IF( $F$4:$F$23=F19, $E$4:$E$23)),E19>0),1,0),\"\")","v":""},""]
[null,null,null,null,null,"",{"$f":"IF(C20<>\"\",IF(AND(E20=MIN( IF( $F$4:$F$23=F20, $E$4:$E$23)),E20>0),1,0),\"\")","v":""},""]
[null,null,null,null,null,"",{"$f":"IF(C21<>\"\",IF(AND(E21=MIN( IF( $F$4:$F$23=F21, $E$4:$E$23)),E21>0),1,0),\"\")","v":""},""]
[null,null,null,null,null,"",{"$f":"IF(C22<>\"\",IF(AND(E22=MIN( IF( $F$4:$F$23=F22, $E$4:$E$23)),E22>0),1,0),\"\")","v":""},""]
[null,null,null,null,null,"",{"$f":"IF(C23<>\"\",IF(AND(E23=MIN( IF( $F$4:$F$23=F23, $E$4:$E$23)),E23>0),1,0),\"\")","v":""},""]
[]
[null,"Driver","Lane","Slowest Lap Time","Fastest Lap Time","Average Lap Time","Total Laps"]

{"sheet":"SumSheet","index":7,"n_rows":54,"n_cols":80,"rows_kept":54,"cut":false,"hidden":false,"merged":[[1,68,1,71],[1,72,1,79],[32,1,32,2],[1,1,2,1],[1,64,1,67],[1,20,1,30],[1,9,1,19],[1,31,1,41],[1,42,1,52],[1,53,1,63],[1,3,1,8]]}
[null,1,{"$f":"B1+1","v":2},{"$f":"C1+1","v":3},4,5,6,7,8,9,10,11,12,13,14,15,16,17,18,19,20,21,22,23,24,25,26,27,28,29,30,31,32,33,34,35,36,37,38,39,40,41,42,43,44,45,46,47,48,49,50,51,52,53,54,55,56,57,58,59,60,61,62,63,64,65,66,{"$f":"BO1+1","v":67},68,69,70,71,72,73,74,75,76,77,78,79]
[null,"Racer",null,"Round 1",null,null,null,null,null,"Round 2",null,null,null,null,null,null,null,null,null,null,"Round 3",null,null,null,null,null,null,null,null,null,null,"Round 4",null,null,null,null,null,null,null,null,null,null,"Round 5",null,null,null,null,null,null,null,null,null,null,"Round 6",null,null,null,null,null,null,null,null,null,null,"Total",null,null,null,"Dropped Round",null,null,null,"Final Classification"]
[null,null,"Group","Laps","Points","Fastest Lap","Total Round Points","Class Rank","Rank","Laps","Points","Fastest Lap","Total Round Points","Running Series Points","Class Rank","Running Class Rank","Change in Class Rank","Overall Rank","Running Overall Rank","Change in Overall Rank","Laps","Points","Fastest Lap","Total Round Points","Running Series Points","Class Rank","Running Class Rank","Change in Class Rank","Overall Rank","Running Overall Rank","Change in Overall Rank","Laps","Points","Fastest Lap","Total Round Points","Running Series Points","Class Rank","Running Class Rank","Change in Class Rank","Overall Rank","Running Overall Rank","Change in Overall Rank","Laps","Points","Fastest Lap","Total Round Points","Running Series Points","Class Rank","Running Class Rank","Change in Class Rank","Overall Rank","Running Overall Rank","Change in Overall Rank","Laps","Points","Fastest Lap","Total Round Points","Running Series Points","Class Rank","Running Class Rank","Change in Class Rank","Overall Rank","Running Overall Rank","Change in Overall Rank","Rounds Run","Points","Fastest Laps","Laps","Round","Points","Fastest Laps","Laps","Points","Fastest Laps","Total Points","Laps","Class Rank","Change in Class Rank","Overall Rank","Change in Overall Rank"]
[null,"Ary B.","A",{"$f":"IF(ISNA(VLOOKUP($B4,Round1Results,2,FALSE)),0,VLOOKUP($B4,Round1Results,2,FALSE))","v":0},{"$f":"IF(ISNA(VLOOKUP($B4,Round1Results,6,FALSE)),0,VLOOKUP($B4,Round1Results,6,FALSE)-F4)","v":0},{"$f":"IF(ISNA(VLOOKUP($B4,Round1Results,5,FALSE)),0,VLOOKUP($B4,Round1Results,5,FALSE))","v":0},{"$f":"SUM(E4:F4)","v":0},{"$f":"IF($BP4>0,SUMPRODUCT(--(C4=C$4:C$28),--(G4<(G$4:G$28)))+1,0)","v":5},{"$f":"IF($BP4>0,RANK(G4,G$4:G$28),0)","v":10},{"$f":"IF(ISNA(VLOOKUP($B4,Round2Results,2,FALSE)),0,VLOOKUP($B4,Round2Results,2,FALSE))","v":219.78},{"$f":"IF(ISNA(VLOOKUP($B4,Round2Results,6,FALSE)),0,VLOOKUP($B4,Round2Results,6,FALSE)-L4)","v":18},{"$f":"IF(ISNA(VLOOKUP($B4,Round2Results,5,FALSE)),0,VLOOKUP($B4,Round2Results,5,FALSE))","v":0},{"$f":"SUM(K4:L4)","v":18},{"$f":"G4+M4","v":18},{"$f":"IF(J4>0,SUMPRODUCT(--($C4=$C$4:$C$28),--(M4<(M$4:M$28)))+1,0)","v":3},{"$f":"IF($BP4>0,SUMPRODUCT(--($C4=$C$4:$C$28),--(N4<(N$4:N$28)))+1,0)","v":5},{"$f":"IF(H4=0,0,H4-P4)","v":0},{"$f":"IF(J4>0,RANK(M4,M$4:M$28),0)","v":3},{"$f":"IF($BP4>0,RANK(N4,N$4:N$28),0)","v":9},{"$f":"IF(I4=0,0,I4-S4)","v":1},{"$f":"IF(ISNA(VLOOKUP($B4,Round3Results,2,FALSE)),0,VLOOKUP($B4,Round3Results,2,FALSE))","v":219.2},{"$f":"IF(ISNA(VLOOKUP($B4,Round3Results,6,FALSE)),0,VLOOKUP($B4,Round3Results,6,FALSE)-W4)","v":18},{"$f":"IF(ISNA(VLOOKUP($B4,Round3Results,5,FALSE)),0,VLOOKUP($B4,Round3Results,5,FALSE))","v":0},{"$f":"SUM(V4:W4)","v":18},{"$f":"N4+X4","v":36},{"$f":"IF(U4>0,SUMPRODUCT(--($C4=$C$4:$C$28),--(X4<(X$4:X$28)))+1,0)","v":3},{"$f":"IF($BP4>0,SUMPRODUCT(--($C4=$C$4:$C$28),--(Y4<(Y$4:Y$28)))+1,0)","v":4},{"$f":"IF(P4=0,0,P4-AA4)","v":1},{"$f":"IF(U4>0,RANK(X4,X$4:X$28),0)","v":3},{"$f":"IF($BP4>0,RANK(Y4,Y$4:Y$28),0)","v":7},{"$f":"IF(S4=0,0,S4-AD4)","v":2},{"$f":"IF(ISNA(VLOOKUP($B4,Round4Results,2,FALSE)),0,VLOOKUP($B4,Round4Results,2,FALSE))","v":0},{"$f":"IF(ISNA(VLOOKUP($B4,Round4Results,6,FALSE)),0,VLOOKUP($B4,Round4Results,6,FALSE)-AH4)","v":0},{"$f":"IF(ISNA(VLOOKUP($B4,Round4Results,5,FALSE)),0,VLOOKUP($B4,Round4Results,5,FALSE))","v":0},{"$f":"SUM(AG4:AH4)","v":0},{"$f":"Y4+AI4","v":36},{"$f":"IF(AF4>0,SUMPRODUCT(--($C4=$C$4:$C$28),--(AI4<(AI$4:AI$28)))+1,0)","v":0},{"$f":"IF($BP4>0,SUMPRODUCT(--($C4=$C$4:$C$28),--(AJ4<(AJ$4:AJ$28)))+1,0)","v":5},{"$f":"IF(AA4=0,0,AA4-AL4)","v":-1},{"$f":"IF(AF4>0,RANK(AI4,AI$4:AI$28),0)","v":0},{"$f":"IF($BP4>0,RANK(AJ4,AJ$4:AJ$28),0)","v":9},{"$f":"IF(AD4=0,0,AD4-AO4)","v":-2},{"$f":"IF(ISNA(VLOOKUP($B4,Round5Results,2,FALSE)),0,VLOOKUP($B4,Round5Results,2,FALSE))","v":150.44999999999999},{"$f":"IF(ISNA(VLOOKUP($B4,Round5Results,6,FALSE)),0,VLOOKUP($B4,Round5Results,6,FALSE)-AS4)","v":11},{"$f":"IF(ISNA(VLOOKUP($B4,Round5Results,5,FALSE)),0,VLOOKUP($B4,Round5Results,5,FALSE))","v":1},{"$f":"SUM(AR4:AS4)","v":12},{"$f":"AJ4+AT4","v":48},{"$f":"IF(AQ4>0,SUMPRODUCT(--($C4=$C$4:$C$28),--(AT4<(AT$4:AT$28)))+1,0)","v":5},{"$f":"IF($BP4>0,SUMPRODUCT(--($C4=$C$4:$C$28),--(AU4<(AU$4:AU$28)))+1,0)","v":5},{"$f":"IF(AL4=0,0,AL4-AW4)","v":0},{"$f":"IF(AQ4>0,RANK(AT4,AT$4:AT$28),0)","v":9},{"$f":"IF($BP4>0,RANK(AU4,AU$4:AU$28),0)","v":9},{"$f":"IF(AO4=0,0,AO4-AZ4)","v":0},{"$f":"IF(ISNA(VLOOKUP($B4,Round6Results,2,FALSE)),0,VLOOKUP($B4,Round6Results,2,FALSE))","v":0},{"$f":"IF(ISNA(VLOOKUP($B4,Round6Results,6,FALSE)),0,VLOOKUP($B4,Round6Results,6,FALSE)-BD4)","v":0},{"$f":"IF(ISNA(VLOOKUP($B4,Round6Results,5,FALSE)),0,VLOOKUP($B4,Round6Results,5,FALSE))","v":0},{"$f":"SUM(BC4:BD4)","v":0},{"$f":"AU4+BE4","v":48},{"$f":"IF(BB4>0,SUMPRODUCT(--($C4=$C$4:$C$28),--(BE4<(BE$4:BE$28)))+1,0)","v":0},{"$f":"IF($BP4>0,SUMPRODUCT(--($C4=$C$4:$C$28),--(BF4<(BF$4:BF$28)))+1,0)","v":5},{"$f":"IF(AW4=0,0,AW4-BH4)","v":0},{"$f":"IF(BB4>0,RANK(BE4,BE$4:BE$28),0)","v":0},{"$f":"IF($BP4>0,RANK(BF4,BF$4:BF$28),0)","v":9},{"$f":"IF(AZ4=0,0,AZ4-BK4)","v":0},{"$f":"COUNTIF(D4,\">0\")+COUNTIF(J4,\">0\")+COUNTIF(U4,\">0\")+COUNTIF(AF4,\">0\")+COUNTIF(AQ4,\">0\")+COUNTIF(BB4,\">0\")","v":3},{"$f":"E4+K4+V4+AG4+AR4+BC4","v":47},{"$f":"F4+L4+W4+AH4+AS4+BD4","v":1},{"$f":"D4+J4+U4+AF4+AQ4+BB4","v":589.43000000000006},null,0,0,0,{"$f":"E4+K4+V4+AG4+AR4+BC4-BR4","v":47},{"$f":"F4+L4+W4+AH4+AS4+BD4-BS4","v":1},{"$f":"BU4+BV4","v":48},{"$f":"D4+J4+U4+AF4+AQ4+BB4-BT4","v":589.43000000000006},{"$f":"IF(BW4>0,SUMPRODUCT(--($C4=$C$4:$C$28),--(BX4<(BX$4:BX$28)),--(BW4<(BW$4:BW$28)))+1,0)","v":5},{"$f":"IF(AND(B4<>\"\",RoundsRun>1),IF(IF(RoundsRun=2,VLOOKUP(B4,SeriesSummary,Round2ClassRankChange,FALSE),IF(RoundsRun=3,VLOOKUP(B4,SeriesSummary,Round3ClassRankChange,FALSE),IF(RoundsRun=4,VLOOKUP(B4,SeriesSummary,Round4ClassRankChange,FALSE),IF(RoundsRun=5,VLOOKUP(B4,SeriesSummary,Round5ClassRankChange,FALSE),IF(RoundsRun=6,VLOOKUP(B4,SeriesSummary,Round6ClassRankChange,FALSE),\"-\")))))>0,\"+\"&IF(RoundsRun=2,VLOOKUP(B4,SeriesSummary,Round2ClassRankChange,FALSE),IF(RoundsRun=3,VLOOKUP(B4,SeriesSummary,Round3ClassRankChange,FALSE),IF(RoundsRun=4,VLOOKUP(B4,SeriesSummary,Round4ClassRankChange,FALSE),IF(RoundsRun=5,VLOOKUP(B4,SeriesSummary,Round5ClassRankChange,FALSE),IF(RoundsRun=6,VLOOKUP(B4,SeriesSummary,Round6ClassRankChange,FALSE),\"-\"))))),IF((IF(RoundsRun=2,VLOOKUP(B4,SeriesSummary,Round2ClassRankChange,FALSE),IF(RoundsRun=3,VLOOKUP(B4,SeriesSummary,Round3ClassRankChange,FALSE),IF(RoundsRun=4,VLOOKUP(B4,SeriesSummary,Round4ClassRankChange,FALSE),IF(RoundsRun=5,VLOOKUP(B4,SeriesSummary,Round5ClassRankChange,FALSE),IF(RoundsRun=6,VLOOKUP(B4,SeriesSummary,Round6ClassRankChange,FALSE),\"-\"))))))=0,\"-\",(IF(RoundsRun=2,VLOOKUP(B4,SeriesSummary,Round2ClassRankChange,FALSE),IF(RoundsRun=3,VLOOKUP(B4,SeriesSummary,Round3ClassRankChange,FALSE),IF(RoundsRun=4,VLOOKUP(B4,SeriesSummary,Round4ClassRankChange,FALSE),IF(RoundsRun=5,VLOOKUP(B4,SeriesSummary,Round5ClassRankChange,FALSE),IF(RoundsRun=6,VLOOKUP(B4,SeriesSummary,Round6ClassRankChange,FALSE),\"-\")))))))),\"-\")","v":"-"},{"$f":"IF(BM4>0,RANK(BW4,$BW$4:$BW$28)+SUMPRODUCT(--($BW$4:$BW$28=BW4),--($BX$4:$BX$28>BX4)),0)","v":9},{"$f":"IF(AND(B4<>\"\",RoundsRun>1),IF(IF(RoundsRun=2,VLOOKUP(B4,SeriesSummary,Round2RankChange,FALSE),IF(RoundsRun=3,VLOOKUP(B4,SeriesSummary,Round3RankChange,FALSE),IF(RoundsRun=4,VLOOKUP(B4,SeriesSummary,Round4RankChange,FALSE),IF(RoundsRun=5,VLOOKUP(B4,SeriesSummary,Round5RankChange,FALSE),IF(RoundsRun=6,VLOOKUP(B4,SeriesSummary,Round6RankChange,FALSE),\"-\")))))>0,\"+\"&IF(RoundsRun=2,VLOOKUP(B4,SeriesSummary,Round2RankChange,FALSE),IF(RoundsRun=3,VLOOKUP(B4,SeriesSummary,Round3RankChange,FALSE),IF(RoundsRun=4,VLOOKUP(B4,SeriesSummary,Round4RankChange,FALSE),IF(RoundsRun=5,VLOOKUP(B4,SeriesSummary,Round5RankChange,FALSE),IF(RoundsRun=6,VLOOKUP(B4,SeriesSummary,Round6RankChange,FALSE),\"-\"))))),IF((IF(RoundsRun=2,VLOOKUP(B4,SeriesSummary,Round2RankChange,FALSE),IF(RoundsRun=3,VLOOKUP(B4,SeriesSummary,Round3RankChange,FALSE),IF(RoundsRun=4,VLOOKUP(B4,SeriesSummary,Round4RankChange,FALSE),IF(RoundsRun=5,VLOOKUP(B4,SeriesSummary,Round5RankChange,FALSE),IF(RoundsRun=6,VLOOKUP(B4,SeriesSummary,Round6RankChange,FALSE),\"-\"))))))=0,\"-\",(IF(RoundsRun=2,VLOOKUP(B4,SeriesSummary,Round2RankChange,FALSE),IF(RoundsRun=3,VLOOKUP(B4,SeriesSummary,Round3RankChange,FALSE),IF(RoundsRun=4,VLOOKUP(B4,SeriesSummary,Round4RankChange,FALSE),IF(RoundsRun=5,VLOOKUP(B4,SeriesSummary,Round5RankChange,FALSE),IF(RoundsRun=6,VLOOKUP(B4,SeriesSummary,Round6RankChange,FALSE),\"-\")))))))),\"-\")","v":"-"}]
[null,"Austin C.","B",198.75,16,1,{"$f":"SUM(E5:F5)","v":17},{"$f":"IF($BP5>0,SUMPRODUCT(--(C5=C$4:C$28),--(G5<(G$4:G$28)))+1,0)","v":1},{"$f":"IF($BP5>0,RANK(G5,G$4:G$28),0)","v":4},0,0,0,{"$f":"SUM(K5:L5)","v":0},{"$f":"G5+M5","v":17},{"$f":"IF(J5>0,SUMPRODUCT(--($C5=$C$4:$C$28),--(M5<(M$4:M$28)))+1,0)","v":0},{"$f":"IF($BP5>0,SUMPRODUCT(--($C5=$C$4:$C$28),--(N5<(N$4:N$28)))+1,0)","v":5},{"$f":"IF(H5=0,0,H5-P5)","v":-4},{"$f":"IF(J5>0,RANK(M5,M$4:M$28),0)","v":0},{"$f":"IF($BP5>0,RANK(N5,N$4:N$28),0)","v":10},{"$f":"IF(I5=0,0,I5-S5)","v":-6},0,0,0,{"$f":"SUM(V5:W5)","v":0},{"$f":"N5+X5","v":17},{"$f":"IF(U5>0,SUMPRODUCT(--($C5=$C$4:$C$28),--(X5<(X$4:X$28)))+1,0)","v":0},{"$f":"IF($BP5>0,SUMPRODUCT(--($C5=$C$4:$C$28),--(Y5<(Y$4:Y$28)))+1,0)","v":5},{"$f":"IF(P5=0,0,P5-AA5)","v":0},{"$f":"IF(U5>0,RANK(X5,X$4:X$28),0)","v":0},{"$f":"IF($BP5>0,RANK(Y5,Y$4:Y$28),0)","v":10},{"$f":"IF(S5=0,0,S5-AD5)","v":0},0,0,0,{"$f":"SUM(AG5:AH5)","v":0},{"$f":"Y5+AI5","v":17},{"$f":"IF(AF5>0,SUMPRODUCT(--($C5=$C$4:$C$28),--(AI5<(AI$4:AI$28)))+1,0)","v":0},{"$f":"IF($BP5>0,SUMPRODUCT(--($C5=$C$4:$C$28),--(AJ5<(AJ$4:AJ$28)))+1,0)","v":5},{"$f":"IF(AA5=0,0,AA5-AL5)","v":0},{"$f":"IF(AF5>0,RANK(AI5,AI$4:AI$28),0)","v":0},{"$f":"IF($BP5>0,RANK(AJ5,AJ$4:AJ$28),0)","v":10},{"$f":"IF(AD5=0,0,AD5-AO5)","v":0},196.45,14,0,{"$f":"SUM(AR5:AS5)","v":14},{"$f":"AJ5+AT5","v":31},{"$f":"IF(AQ5>0,SUMPRODUCT(--($C5=$C$4:$C$28),--(AT5<(AT$4:AT$28)))+1,0)","v":3},{"$f":"IF($BP5>0,SUMPRODUCT(--($C5=$C$4:$C$28),--(AU5<(AU$4:AU$28)))+1,0)","v":5},{"$f":"IF(AL5=0,0,AL5-AW5)","v":0},{"$f":"IF(AQ5>0,RANK(AT5,AT$4:AT$28),0)","v":7},{"$f":"IF($BP5>0,RANK(AU5,AU$4:AU$28),0)","v":11},{"$f":"IF(AO5=0,0,AO5-AZ5)","v":-1},0,0,0,{"$f":"SUM(BC5:BD5)","v":0},{"$f":"AU5+BE5","v":31},{"$f":"IF(BB5>0,SUMPRODUCT(--($C5=$C$4:$C$28),--(BE5<(BE$4:BE$28)))+1,0)","v":0},{"$f":"IF($BP5>0,SUMPRODUCT(--($C5=$C$4:$C$28),--(BF5<(BF$4:BF$28)))+1,0)","v":5},{"$f":"IF(AW5=0,0,AW5-BH5)","v":0},{"$f":"IF(BB5>0,RANK(BE5,BE$4:BE$28),0)","v":0},{"$f":"IF($BP5>0,RANK(BF5,BF$4:BF$28),0)","v":11},{"$f":"IF(AZ5=0,0,AZ5-BK5)","v":0},2,30,1,395.2,null,0,0,0,30,1,{"$f":"BU5+BV5","v":31},395.2,{"$f":"IF(BW5>0,SUMPRODUCT(--($C5=$C$4:$C$28),--(BX5<(BX$4:BX$28)),--(BW5<(BW$4:BW$28)))+1,0)","v":5},"-",{"$f":"IF(BM5>0,RANK(BW5,$BW$4:$BW$28)+SUMPRODUCT(--($BW$4:$BW$28=BW5),--($BX$4:$BX$28>BX5)),0)","v":11},-1]
[null,"Bob L.","B",0,0,0,{"$f":"SUM(E6:F6)","v":0},0,0,0,0,0,0,0,0,0,0,0,0,0,0,0,0,{"$f":"SUM(V6:W6)","v":0},0,0,0,0,0,0,0,0,0,0,{"$f":"SUM(AG6:AH6)","v":0},0,0,0,0,0,0,0,0,0,0,{"$f":"SUM(AR6:AS6)","v":0},0,0,0,0,0,0,0,0,0,0,{"$f":"SUM(BC6:BD6)","v":0},0,0,0,0,0,0,0,0,0,0,0,null,0,0,0,0,0,{"$f":"BU6+BV6","v":0},0,0,"-",{"$f":"IF(BM6>0,RANK(BW6,$BW$4:$BW$28)+SUMPRODUCT(--($BW$4:$BW$28=BW6),--($BX$4:$BX$28>BX6)),0)","v":0},"-"]
[null,"Brett L.","B",0,0,0,0,0,0,0,0,0,0,0,0,0,0,0,0,0,0,0,0,0,0,0,0,0,0,0,0,0,0,0,0,0,0,0,0,0,0,0,0,0,0,0,0,0,0,0,0,0,0,0,0,0,0,0,0,0,0,0,0,0,0,0,0,0,null,0,0,0,0,0,0,0,0,"-",0,"-"]
[null,"Brian H.","A",0,0,0,0,0,0,0,0,0,0,0,0,0,0,0,0,0,0,0,0,0,0,0,0,0,0,0,0,0,0,0,0,0,0,0,0,0,0,0,0,0,0,0,0,0,0,0,0,0,0,0,0,0,0,0,0,0,0,0,0,0,0,0,0,0,null,0,0,0,0,0,0,0,0,"-",0,"-"]
[null,"Jordan C.","B",196,15,0,15,2,6,205.6,14,1,15,30,1,1,1,6,5,1,215.8,17,1,18,48,1,1,0,3,3,2,217.8,19,1,20,68,1,1,0,2,2,1,213.77,18,1,19,87,1,1,0,2,2,0,0,0,0,0,87,0,1,0,0,2,0,5,83,4,1048.97,null,0,0,0,83,4,87,1048.97,1,"-",2,"-"]
[null,"Marty M.","A",215.78,18,1,19,2,2,219.86,19,0,19,38,2,2,0,2,2,0,223.31,20,0,20,58,1,2,0,1,2,0,0,0,0,0,58,0,3,-1,0,4,-2,0,0,0,0,58,0,4,-1,0,7,-3,0,0,0,0,58,0,4,0,0,7,0,3,57,1,658.95,null,0,0,0,57,1,58,658.95,4,-1,7,-3]
[null,"Rich C.","B",181.8,13,0,13,4,8,195.84,13,0,13,26,2,2,2,8,6,2,0,0,0,0,26,0,4,-2,0,9,-3,202.45,16,0,16,42,2,4,0,5,8,1,200.35,15,0,15,57,2,4,0,6,8,0,0,0,0,0,57,0,4,0,0,8,0,4,57,0,780.43999999999994,null,0,0,0,57,0,57,780.43999999999994,4,"-",8,"-"]
[null,"Roy M.","A",218.18,20,0,20,1,1,214.3,16,0,16,36,5,3,-2,5,3,-2,0,0,0,0,36,0,4,-1,0,7,-4,216.45,18,0,18,54,2,4,0,3,6,1,218.4,19,0,19,73,2,3,1,2,4,2,0,0,0,0,73,0,3,0,0,4,0,4,73,0,867.33,null,0,0,0,73,0,73,867.33,3,"+1",4,"+2"]
[null,"Russell M.","A",215.82,19,0,19,2,2,220.71,20,1,21,40,1,1,1,1,1,1,221.41,19,1,20,60,1,1,0,1,1,0,226.31,20,1,21,81,1,1,0,1,1,0,221.3,20,0,20,101,1,1,0,1,1,0,0,0,0,0,101,0,1,0,0,1,0,5,98,3,1105.55,null,0,0,0,98,3,101,1105.55,1,"-",1,"-"]
[null,"Shawn G.","A",0,0,0,0,5,10,215.75,17,0,17,17,4,6,-1,4,10,0,0,0,0,0,17,0,6,0,0,10,0,0,0,0,0,17,0,6,0,0,10,0,212.46,17,0,17,34,3,6,0,4,10,0,0,0,0,0,34,0,6,0,0,10,0,2,34,0,428.21000000000004,null,0,0,0,34,0,34,428.21000000000004,6,"-",10,"-"]
[null,"Stephen B.","A",211.8,17,0,17,4,4,211.25,15,0,15,32,6,4,0,6,4,0,213.58,16,0,16,48,4,3,1,5,3,1,213.21,17,0,17,65,3,2,1,4,3,0,207.38,16,0,16,81,4,2,0,5,3,0,0,0,0,0,81,0,2,0,0,3,0,5,81,0,1057.22,null,0,0,0,81,0,81,1057.22,2,"-",3,"-"]
[null,"David C.","B",183.95,14,0,{"$f":"SUM(E16:F16)","v":14},3,7,181.99,12,0,12,26,3,2,1,9,6,1,190.95,15,0,{"$f":"SUM(V16:W16)","v":15},41,2,2,0,6,5,1,191.8,15,0,{"$f":"SUM(AG16:AH16)","v":15},56,3,2,0,6,5,0,183.45,13,0,{"$f":"SUM(AR16:AS16)","v":13},69,4,2,0,8,5,0,0,0,0,{"$f":"SUM(BC16:BD16)","v":0},69,0,2,0,0,5,0,5,69,0,932.1400000000001,null,0,0,0,69,0,69,932.1400000000001,2,"-",5,"-"]
[null,"Nick M.","B",0,0,0,0,0,0,0,0,0,0,0,0,0,0,0,0,0,0,0,0,0,0,0,0,0,0,0,0,0,0,0,0,0,0,0,0,0,0,0,0,0,0,0,0,0,0,0,0,0,0,0,0,0,0,0,0,0,0,0,0,0,0,0,0,0,null,0,0,0,0,0,0,0,0,"-",0,"-"]
[null,"Mark L.","B",175,12,0,12,5,9,180.61,11,0,11,23,4,4,1,10,8,1,182.31,14,0,14,37,3,3,1,7,6,2,183.78,14,0,14,51,4,3,0,7,7,-1,173.87,12,0,12,63,5,3,0,9,6,1,0,0,0,0,63,0,3,0,0,6,0,5,63,0,895.57,null,0,0,0,63,0,63,895.57,3,"-",6,"+1"]
[null,null,null,0,0,0,0,0,0,0,0,0,0,0,0,0,0,0,0,0,0,0,0,0,0,0,0,0,0,0,0,0,0,0,0,0,0,0,0,0,0,0,0,0,0,0,0,0,0,0,0,0,0,0,0,0,0,0,0,0,0,0,0,0,0,0,0,0,null,0,0,0,0,0,0,0,0,"-",0,"-"]
[null,null,null,0,0,0,0,0,0,0,0,0,0,0,0,0,0,0,0,0,0,0,0,0,0,0,0,0,0,0,0,0,0,0,0,0,0,0,0,0,0,0,0,0,0,0,0,0,0,0,0,0,0,0,0,0,0,0,0,0,0,0,0,0,0,0,0,0,null,0,0,0,0,0,0,0,0,"-",0,"-"]
[null,null,null,0,0,0,0,0,0,0,0,0,0,0,0,0,0,0,0,0,0,0,0,0,0,0,0,0,0,0,0,0,0,0,0,0,0,0,0,0,0,0,0,0,0,0,0,0,0,0,0,0,0,0,0,0,0,0,0,0,0,0,0,0,0,0,0,0,null,{"$f":"MIN(E21,K21,V21,AG21,AR21,BC21)","v":0},0,0,0,0,0,0,0,"-",0,"-"]
[null,null,null,0,0,0,0,0,0,0,0,0,0,0,0,0,0,0,0,0,0,0,0,0,0,0,0,0,0,0,0,0,0,0,0,0,0,0,0,0,0,0,0,0,0,0,0,0,0,0,0,0,0,0,0,0,0,0,0,0,0,0,0,0,0,0,0,0,null,0,0,0,0,0,0,0,0,"-",0,"-"]
[null,null,null,0,0,0,0,0,0,0,0,0,0,0,0,0,0,0,0,0,0,0,0,0,0,0,0,0,0,0,0,0,0,0,0,0,0,0,0,0,0,0,0,0,0,0,0,0,0,0,0,0,0,0,0,0,0,0,0,0,0,0,0,0,0,0,0,0,null,{"$f":"MIN(E23,K23,V23,AG23,AR23,BC23)","v":0},0,0,0,0,0,0,0,"-",0,"-"]
[null,null,null,0,0,0,0,0,0,0,0,0,0,0,0,0,0,0,0,0,0,0,0,0,0,0,0,0,0,0,0,0,0,0,0,0,0,0,0,0,0,0,0,0,0,0,0,0,0,0,0,0,0,0,0,0,0,0,0,0,0,0,0,0,0,0,0,0,null,0,0,0,0,0,0,0,0,"-",0,"-"]
[null,null,null,0,0,0,0,0,0,0,0,0,0,0,0,0,0,0,0,0,0,0,0,0,0,0,0,0,0,0,0,0,0,0,0,0,0,0,0,0,0,0,0,0,0,0,0,0,0,0,0,0,0,0,0,0,0,0,0,0,0,0,0,0,0,0,0,0,null,0,0,0,0,0,0,0,0,"-",0,"-"]
[null,null,null,0,0,0,0,0,0,0,0,0,0,0,0,0,0,0,0,0,0,0,0,0,0,0,0,0,0,0,0,0,0,0,0,0,0,0,0,0,0,0,0,0,0,0,0,0,0,0,0,0,0,0,0,0,0,0,0,0,0,0,0,0,0,0,0,0,null,0,0,0,0,0,0,0,0,"-",0,"-"]
[null,null,null,0,0,0,0,0,0,0,0,0,0,0,0,0,0,0,0,0,0,0,0,0,0,0,0,0,0,0,0,0,0,0,0,0,0,0,0,0,0,0,0,0,0,0,0,0,0,0,0,0,0,0,0,0,0,0,0,0,0,0,0,0,0,0,0,0,null,0,0,0,0,0,0,0,0,"-",0,"-"]
[null,null,null,0,0,0,0,0,0,0,0,0,0,0,0,0,0,0,0,0,0,0,0,0,0,0,0,0,0,0,0,0,0,0,0,0,0,0,0,0,0,0,0,0,0,0,0,0,0,0,0,0,0,0,0,0,0,0,0,0,0,0,0,0,0,0,0,0,null,0,0,0,0,0,0,0,0,"-",0,"-"]
[]
[]
[null,"Series Name","Can Am 2014"]
[null,"Rounds Run",{"$f":"COUNT('Round 1'!B4,'Round 2'!B4,'Round 3'!B4,'Round 4'!B4,'Round 5'!B4,'Round 6'!B4)","v":5}]
[null,"Points Table"]
[null,"Position","Points"]
[null,1,20]
[null,2,19]
[null,3,18]
[null,4,17]
[null,5,16]
[null,6,15]
[null,7,14]
[null,8,13]
[null,9,12]
[null,10,11]
[null,11,10]
[null,12,9]
[null,13,8]
[null,14,7]
[null,15,6]
[null,16,5]
[null,17,4]
[null,18,3]
[null,19,2]
[null,20,1]